Bump react-native
to 0.76.7
#4136
Triggered via pull request
February 19, 2025 02:54
Status
Failure
Total duration
29m 16s
Artifacts
–
ci.yaml
on: pull_request
create-timestamp
/
Create timestamp
3s
create-cache-key
/
Create cache key
5s
jest-test
/
Jest test
2m 33s
Matrix: android-build
Matrix: android-ubuntu-e2e-test-ci
Matrix: android-ubuntu-integration-test-ci
ios-integration-test
/
IOS Integration test
8m 49s
Annotations
58 errors and 56 warnings
ios-integration-test / IOS Integration test
Final attempt failed. Child_process exited with error code 65
|
android-ubuntu-integration-test-ci (x86, 29, default) / Android Ubuntu Integration test (execute_send_from_orchard)
System.IO.IOException: No space left on device : '/home/runner/runners/2.322.0/_diag/Worker_20250219-025611-utc.log'
at System.IO.RandomAccess.WriteAtOffset(SafeFileHandle handle, ReadOnlySpan`1 buffer, Int64 fileOffset)
at System.IO.StreamWriter.Flush(Boolean flushStream, Boolean flushEncoder)
at System.Diagnostics.TextWriterTraceListener.Flush()
at GitHub.Runner.Common.HostTraceListener.WriteHeader(String source, TraceEventType eventType, Int32 id)
at System.Diagnostics.TraceSource.TraceEvent(TraceEventType eventType, Int32 id, String message)
at GitHub.Runner.Worker.Worker.RunAsync(String pipeIn, String pipeOut)
at GitHub.Runner.Worker.Program.MainAsync(IHostContext context, String[] args)
System.IO.IOException: No space left on device : '/home/runner/runners/2.322.0/_diag/Worker_20250219-025611-utc.log'
at System.IO.RandomAccess.WriteAtOffset(SafeFileHandle handle, ReadOnlySpan`1 buffer, Int64 fileOffset)
at System.IO.StreamWriter.Flush(Boolean flushStream, Boolean flushEncoder)
at System.Diagnostics.TextWriterTraceListener.Flush()
at GitHub.Runner.Common.HostTraceListener.WriteHeader(String source, TraceEventType eventType, Int32 id)
at System.Diagnostics.TraceSource.TraceEvent(TraceEventType eventType, Int32 id, String message)
at GitHub.Runner.Common.Tracing.Error(Exception exception)
at GitHub.Runner.Worker.Program.MainAsync(IHostContext context, String[] args)
Unhandled exception. System.IO.IOException: No space left on device : '/home/runner/runners/2.322.0/_diag/Worker_20250219-025611-utc.log'
at System.IO.RandomAccess.WriteAtOffset(SafeFileHandle handle, ReadOnlySpan`1 buffer, Int64 fileOffset)
at System.IO.StreamWriter.Flush(Boolean flushStream, Boolean flushEncoder)
at System.Diagnostics.TextWriterTraceListener.Flush()
at System.Diagnostics.TraceSource.Flush()
at GitHub.Runner.Common.Tracing.Dispose(Boolean disposing)
at GitHub.Runner.Common.Tracing.Dispose()
at GitHub.Runner.Common.TraceManager.Dispose(Boolean disposing)
at GitHub.Runner.Common.TraceManager.Dispose()
at GitHub.Runner.Common.HostContext.Dispose(Boolean disposing)
at GitHub.Runner.Common.HostContext.Dispose()
at GitHub.Runner.Worker.Program.Main(String[] args)
|
android-ubuntu-integration-test-ci (x86, 29, default) / Android Ubuntu Integration test (execute_currentprice_and_value_transfers_from_seed)
System.IO.IOException: No space left on device : '/home/runner/runners/2.322.0/_diag/Worker_20250219-025606-utc.log'
at System.IO.RandomAccess.WriteAtOffset(SafeFileHandle handle, ReadOnlySpan`1 buffer, Int64 fileOffset)
at System.IO.StreamWriter.Flush(Boolean flushStream, Boolean flushEncoder)
at System.Diagnostics.TextWriterTraceListener.Flush()
at GitHub.Runner.Common.HostTraceListener.WriteHeader(String source, TraceEventType eventType, Int32 id)
at System.Diagnostics.TraceSource.TraceEvent(TraceEventType eventType, Int32 id, String message)
at GitHub.Runner.Worker.Worker.RunAsync(String pipeIn, String pipeOut)
at GitHub.Runner.Worker.Program.MainAsync(IHostContext context, String[] args)
System.IO.IOException: No space left on device : '/home/runner/runners/2.322.0/_diag/Worker_20250219-025606-utc.log'
at System.IO.RandomAccess.WriteAtOffset(SafeFileHandle handle, ReadOnlySpan`1 buffer, Int64 fileOffset)
at System.IO.StreamWriter.Flush(Boolean flushStream, Boolean flushEncoder)
at System.Diagnostics.TextWriterTraceListener.Flush()
at GitHub.Runner.Common.HostTraceListener.WriteHeader(String source, TraceEventType eventType, Int32 id)
at System.Diagnostics.TraceSource.TraceEvent(TraceEventType eventType, Int32 id, String message)
at GitHub.Runner.Common.Tracing.Error(Exception exception)
at GitHub.Runner.Worker.Program.MainAsync(IHostContext context, String[] args)
Unhandled exception. System.IO.IOException: No space left on device : '/home/runner/runners/2.322.0/_diag/Worker_20250219-025606-utc.log'
at System.IO.RandomAccess.WriteAtOffset(SafeFileHandle handle, ReadOnlySpan`1 buffer, Int64 fileOffset)
at System.IO.StreamWriter.Flush(Boolean flushStream, Boolean flushEncoder)
at System.Diagnostics.TextWriterTraceListener.Flush()
at System.Diagnostics.TraceSource.Flush()
at GitHub.Runner.Common.Tracing.Dispose(Boolean disposing)
at GitHub.Runner.Common.Tracing.Dispose()
at GitHub.Runner.Common.TraceManager.Dispose(Boolean disposing)
at GitHub.Runner.Common.TraceManager.Dispose()
at GitHub.Runner.Common.HostContext.Dispose(Boolean disposing)
at GitHub.Runner.Common.HostContext.Dispose()
at GitHub.Runner.Worker.Program.Main(String[] args)
|
android-ubuntu-integration-test-ci (x86, 29, default) / Android Ubuntu Integration test (execute_sapling_balance_from_seed)
System.IO.IOException: No space left on device : '/home/runner/runners/2.322.0/_diag/Worker_20250219-025606-utc.log'
at System.IO.RandomAccess.WriteAtOffset(SafeFileHandle handle, ReadOnlySpan`1 buffer, Int64 fileOffset)
at System.IO.StreamWriter.Flush(Boolean flushStream, Boolean flushEncoder)
at System.Diagnostics.TextWriterTraceListener.Flush()
at GitHub.Runner.Common.HostTraceListener.WriteHeader(String source, TraceEventType eventType, Int32 id)
at System.Diagnostics.TraceSource.TraceEvent(TraceEventType eventType, Int32 id, String message)
at GitHub.Runner.Worker.Worker.RunAsync(String pipeIn, String pipeOut)
at GitHub.Runner.Worker.Program.MainAsync(IHostContext context, String[] args)
System.IO.IOException: No space left on device : '/home/runner/runners/2.322.0/_diag/Worker_20250219-025606-utc.log'
at System.IO.RandomAccess.WriteAtOffset(SafeFileHandle handle, ReadOnlySpan`1 buffer, Int64 fileOffset)
at System.IO.StreamWriter.Flush(Boolean flushStream, Boolean flushEncoder)
at System.Diagnostics.TextWriterTraceListener.Flush()
at GitHub.Runner.Common.HostTraceListener.WriteHeader(String source, TraceEventType eventType, Int32 id)
at System.Diagnostics.TraceSource.TraceEvent(TraceEventType eventType, Int32 id, String message)
at GitHub.Runner.Common.Tracing.Error(Exception exception)
at GitHub.Runner.Worker.Program.MainAsync(IHostContext context, String[] args)
Unhandled exception. System.IO.IOException: No space left on device : '/home/runner/runners/2.322.0/_diag/Worker_20250219-025606-utc.log'
at System.IO.RandomAccess.WriteAtOffset(SafeFileHandle handle, ReadOnlySpan`1 buffer, Int64 fileOffset)
at System.IO.StreamWriter.Flush(Boolean flushStream, Boolean flushEncoder)
at System.Diagnostics.TextWriterTraceListener.Flush()
at System.Diagnostics.TraceSource.Flush()
at GitHub.Runner.Common.Tracing.Dispose(Boolean disposing)
at GitHub.Runner.Common.Tracing.Dispose()
at GitHub.Runner.Common.TraceManager.Dispose(Boolean disposing)
at GitHub.Runner.Common.TraceManager.Dispose()
at GitHub.Runner.Common.HostContext.Dispose(Boolean disposing)
at GitHub.Runner.Common.HostContext.Dispose()
at GitHub.Runner.Worker.Program.Main(String[] args)
|
android-ubuntu-integration-test-ci (x86, 29, default) / Android Ubuntu Integration test (execute_parse_addresses)
System.IO.IOException: No space left on device : '/home/runner/runners/2.322.0/_diag/Worker_20250219-025606-utc.log'
Unhandled exception. System.IO.IOException: No space left on device : '/home/runner/runners/2.322.0/_diag/Worker_20250219-025606-utc.log'
at System.IO.RandomAccess.WriteAtOffset(SafeFileHandle handle, ReadOnlySpan`1 buffer, Int64 fileOffset)
at System.IO.StreamWriter.Flush(Boolean flushStream, Boolean flushEncoder)
at System.Diagnostics.TextWriterTraceListener.Flush()
at System.Diagnostics.TraceSource.Flush()
at GitHub.Runner.Common.Tracing.Dispose(Boolean disposing)
at GitHub.Runner.Common.Tracing.Dispose()
at GitHub.Runner.Common.TraceManager.Dispose(Boolean disposing)
at GitHub.Runner.Common.TraceManager.Dispose()
at GitHub.Runner.Common.HostContext.Dispose(Boolean disposing)
at GitHub.Runner.Common.HostContext.Dispose()
at GitHub.Runner.Worker.Program.Main(String[] args)
at System.IO.RandomAccess.WriteAtOffset(SafeFileHandle handle, ReadOnlySpan`1 buffer, Int64 fileOffset)
at System.IO.StreamWriter.Flush(Boolean flushStream, Boolean flushEncoder)
at System.Diagnostics.TextWriterTraceListener.Flush()
at GitHub.Runner.Common.HostTraceListener.WriteHeader(String source, TraceEventType eventType, Int32 id)
at System.Diagnostics.TraceSource.TraceEvent(TraceEventType eventType, Int32 id, String message)
at GitHub.Runner.Worker.Worker.RunAsync(String pipeIn, String pipeOut)
at GitHub.Runner.Worker.Program.MainAsync(IHostContext context, String[] args)
System.IO.IOException: No space left on device : '/home/runner/runners/2.322.0/_diag/Worker_20250219-025606-utc.log'
at System.IO.RandomAccess.WriteAtOffset(SafeFileHandle handle, ReadOnlySpan`1 buffer, Int64 fileOffset)
at System.IO.StreamWriter.Flush(Boolean flushStream, Boolean flushEncoder)
at System.Diagnostics.TextWriterTraceListener.Flush()
at GitHub.Runner.Common.HostTraceListener.WriteHeader(String source, TraceEventType eventType, Int32 id)
at System.Diagnostics.TraceSource.TraceEvent(TraceEventType eventType, Int32 id, String message)
at GitHub.Runner.Common.Tracing.Error(Exception exception)
at GitHub.Runner.Worker.Program.MainAsync(IHostContext context, String[] args)
|
android-ubuntu-e2e-test-ci (x86, 28, default) / Android Ubuntu e2e test (change_custom_regtest_server)
The process '/usr/bin/sh' failed with exit code 1
|
android-ubuntu-e2e-test-ci (x86, 28, default) / Android Ubuntu e2e test (sync_report)
The process '/usr/bin/sh' failed with exit code 1
|
android-ubuntu-e2e-test-ci (x86, 28, default) / Android Ubuntu e2e test (send)
The process '/usr/bin/sh' failed with exit code 1
|
android-ubuntu-e2e-test-ci (x86, 28, default) / Android Ubuntu e2e test (shielding)
The process '/usr/bin/sh' failed with exit code 1
|
android-ubuntu-e2e-test-ci (x86, 28, default) / Android Ubuntu e2e test (screen_awake)
The process '/usr/bin/sh' failed with exit code 1
|
android-ubuntu-e2e-test-ci (x86, 28, default) / Android Ubuntu e2e test (change_server_from_list)
System.IO.IOException: No space left on device : '/home/runner/runners/2.322.0/_diag/Worker_20250219-025606-utc.log'
at System.IO.RandomAccess.WriteAtOffset(SafeFileHandle handle, ReadOnlySpan`1 buffer, Int64 fileOffset)
at System.IO.StreamWriter.Flush(Boolean flushStream, Boolean flushEncoder)
at System.Diagnostics.TextWriterTraceListener.Flush()
at GitHub.Runner.Common.HostTraceListener.WriteHeader(String source, TraceEventType eventType, Int32 id)
at System.Diagnostics.TraceSource.TraceEvent(TraceEventType eventType, Int32 id, String message)
at GitHub.Runner.Worker.Worker.RunAsync(String pipeIn, String pipeOut)
at GitHub.Runner.Worker.Program.MainAsync(IHostContext context, String[] args)
System.IO.IOException: No space left on device : '/home/runner/runners/2.322.0/_diag/Worker_20250219-025606-utc.log'
at System.IO.RandomAccess.WriteAtOffset(SafeFileHandle handle, ReadOnlySpan`1 buffer, Int64 fileOffset)
at System.IO.StreamWriter.Flush(Boolean flushStream, Boolean flushEncoder)
at System.Diagnostics.TextWriterTraceListener.Flush()
at GitHub.Runner.Common.HostTraceListener.WriteHeader(String source, TraceEventType eventType, Int32 id)
at System.Diagnostics.TraceSource.TraceEvent(TraceEventType eventType, Int32 id, String message)
at GitHub.Runner.Common.Tracing.Error(Exception exception)
at GitHub.Runner.Worker.Program.MainAsync(IHostContext context, String[] args)
Unhandled exception. System.IO.IOException: No space left on device : '/home/runner/runners/2.322.0/_diag/Worker_20250219-025606-utc.log'
at System.IO.RandomAccess.WriteAtOffset(SafeFileHandle handle, ReadOnlySpan`1 buffer, Int64 fileOffset)
at System.IO.StreamWriter.Flush(Boolean flushStream, Boolean flushEncoder)
at System.Diagnostics.TextWriterTraceListener.Flush()
at System.Diagnostics.TraceSource.Flush()
at GitHub.Runner.Common.Tracing.Dispose(Boolean disposing)
at GitHub.Runner.Common.Tracing.Dispose()
at GitHub.Runner.Common.TraceManager.Dispose(Boolean disposing)
at GitHub.Runner.Common.TraceManager.Dispose()
at GitHub.Runner.Common.HostContext.Dispose(Boolean disposing)
at GitHub.Runner.Common.HostContext.Dispose()
at GitHub.Runner.Worker.Program.Main(String[] args)
|
android-ubuntu-e2e-test-ci (x86, 28, default) / Android Ubuntu e2e test (reload_while_tx_pending)
The process '/usr/bin/sh' failed with exit code 1
|
android-ubuntu-e2e-test-ci (x86, 28, default) / Android Ubuntu e2e test (change_custom_server)
System.IO.IOException: No space left on device : '/home/runner/runners/2.322.0/_diag/Worker_20250219-025604-utc.log'
at System.IO.RandomAccess.WriteAtOffset(SafeFileHandle handle, ReadOnlySpan`1 buffer, Int64 fileOffset)
at System.IO.StreamWriter.Flush(Boolean flushStream, Boolean flushEncoder)
at System.Diagnostics.TextWriterTraceListener.Flush()
at GitHub.Runner.Common.HostTraceListener.WriteHeader(String source, TraceEventType eventType, Int32 id)
at System.Diagnostics.TraceSource.TraceEvent(TraceEventType eventType, Int32 id, String message)
at GitHub.Runner.Worker.Worker.RunAsync(String pipeIn, String pipeOut)
at GitHub.Runner.Worker.Program.MainAsync(IHostContext context, String[] args)
System.IO.IOException: No space left on device : '/home/runner/runners/2.322.0/_diag/Worker_20250219-025604-utc.log'
at System.IO.RandomAccess.WriteAtOffset(SafeFileHandle handle, ReadOnlySpan`1 buffer, Int64 fileOffset)
at System.IO.StreamWriter.Flush(Boolean flushStream, Boolean flushEncoder)
at System.Diagnostics.TextWriterTraceListener.Flush()
at GitHub.Runner.Common.HostTraceListener.WriteHeader(String source, TraceEventType eventType, Int32 id)
at System.Diagnostics.TraceSource.TraceEvent(TraceEventType eventType, Int32 id, String message)
at GitHub.Runner.Common.Tracing.Error(Exception exception)
at GitHub.Runner.Worker.Program.MainAsync(IHostContext context, String[] args)
Unhandled exception. System.IO.IOException: No space left on device : '/home/runner/runners/2.322.0/_diag/Worker_20250219-025604-utc.log'
at System.IO.RandomAccess.WriteAtOffset(SafeFileHandle handle, ReadOnlySpan`1 buffer, Int64 fileOffset)
at System.IO.StreamWriter.Flush(Boolean flushStream, Boolean flushEncoder)
at System.Diagnostics.TextWriterTraceListener.Flush()
at System.Diagnostics.TraceSource.Flush()
at GitHub.Runner.Common.Tracing.Dispose(Boolean disposing)
at GitHub.Runner.Common.Tracing.Dispose()
at GitHub.Runner.Common.TraceManager.Dispose(Boolean disposing)
at GitHub.Runner.Common.TraceManager.Dispose()
at GitHub.Runner.Common.HostContext.Dispose(Boolean disposing)
at GitHub.Runner.Common.HostContext.Dispose()
at GitHub.Runner.Worker.Program.Main(String[] args)
|
android-ubuntu-e2e-test-ci (x86, 28, default) / Android Ubuntu e2e test (new_wallet)
The process '/usr/bin/sh' failed with exit code 1
|
android-ubuntu-e2e-test-ci (x86, 28, default) / Android Ubuntu e2e test (transaction_history)
The process '/usr/bin/sh' failed with exit code 1
|
android-ubuntu-e2e-test-ci (x86, 28, default) / Android Ubuntu e2e test (tex_send_address)
The process '/usr/bin/sh' failed with exit code 1
|
android-ubuntu-e2e-test-ci (x86, 28, default) / Android Ubuntu e2e test (parse_invalid_address)
The process '/usr/bin/sh' failed with exit code 1
|
android-ubuntu-e2e-test-ci (x86, 28, default) / Android Ubuntu e2e test (change_custom_testnet_server)
The process '/usr/bin/sh' failed with exit code 1
|
android-ubuntu-e2e-test-ci (x86_64, 30, default) / Android Ubuntu e2e test (reload_while_tx_pending)
FailFast: cancelling since parallel instance has failed
|
android-ubuntu-e2e-test-ci (x86_64, 30, default) / Android Ubuntu e2e test (reload_while_tx_pending)
The operation was canceled.
|
android-ubuntu-e2e-test-ci (x86_64, 30, default) / Android Ubuntu e2e test (tex_send_address)
FailFast: cancelling since parallel instance has failed
|
android-ubuntu-e2e-test-ci (x86_64, 30, default) / Android Ubuntu e2e test (tex_send_address)
The operation was canceled.
|
android-ubuntu-e2e-test-ci (x86_64, 30, default) / Android Ubuntu e2e test (change_custom_testnet_server)
FailFast: cancelling since parallel instance has failed
|
android-ubuntu-e2e-test-ci (x86_64, 30, default) / Android Ubuntu e2e test (change_custom_testnet_server)
The operation was canceled.
|
android-ubuntu-e2e-test-ci (x86_64, 30, default) / Android Ubuntu e2e test (new_wallet)
FailFast: cancelling since parallel instance has failed
|
android-ubuntu-e2e-test-ci (x86_64, 30, default) / Android Ubuntu e2e test (new_wallet)
The operation was canceled.
|
android-ubuntu-e2e-test-ci (x86_64, 30, default) / Android Ubuntu e2e test (shielding)
FailFast: cancelling since parallel instance has failed
|
android-ubuntu-e2e-test-ci (x86_64, 30, default) / Android Ubuntu e2e test (shielding)
The operation was canceled.
|
android-ubuntu-e2e-test-ci (x86_64, 30, default) / Android Ubuntu e2e test (transaction_history)
FailFast: cancelling since parallel instance has failed
|
android-ubuntu-e2e-test-ci (x86_64, 30, default) / Android Ubuntu e2e test (transaction_history)
The operation was canceled.
|
android-ubuntu-e2e-test-ci (x86_64, 30, default) / Android Ubuntu e2e test (screen_awake)
FailFast: cancelling since parallel instance has failed
|
android-ubuntu-e2e-test-ci (x86_64, 30, default) / Android Ubuntu e2e test (screen_awake)
The operation was canceled.
|
android-ubuntu-e2e-test-ci (x86_64, 30, default) / Android Ubuntu e2e test (parse_invalid_address)
FailFast: cancelling since parallel instance has failed
|
android-ubuntu-e2e-test-ci (x86_64, 30, default) / Android Ubuntu e2e test (parse_invalid_address)
The operation was canceled.
|
android-ubuntu-e2e-test-ci (x86_64, 30, default) / Android Ubuntu e2e test (send)
FailFast: cancelling since parallel instance has failed
|
android-ubuntu-e2e-test-ci (x86_64, 30, default) / Android Ubuntu e2e test (send)
The operation was canceled.
|
android-ubuntu-e2e-test-ci (x86_64, 30, default) / Android Ubuntu e2e test (change_custom_regtest_server)
FailFast: cancelling since parallel instance has failed
|
android-ubuntu-e2e-test-ci (x86_64, 30, default) / Android Ubuntu e2e test (change_custom_regtest_server)
The operation was canceled.
|
android-ubuntu-e2e-test-ci (x86_64, 30, default) / Android Ubuntu e2e test (change_server_from_list)
FailFast: cancelling since parallel instance has failed
|
android-ubuntu-e2e-test-ci (x86_64, 30, default) / Android Ubuntu e2e test (change_server_from_list)
The operation was canceled.
|
android-ubuntu-e2e-test-ci (x86_64, 30, default) / Android Ubuntu e2e test (sync_report)
FailFast: cancelling since parallel instance has failed
|
android-ubuntu-e2e-test-ci (x86_64, 30, default) / Android Ubuntu e2e test (sync_report)
The operation was canceled.
|
android-ubuntu-e2e-test-ci (x86_64, 30, default) / Android Ubuntu e2e test (change_custom_server)
FailFast: cancelling since parallel instance has failed
|
android-ubuntu-e2e-test-ci (x86_64, 30, default) / Android Ubuntu e2e test (change_custom_server)
The operation was canceled.
|
android-ubuntu-integration-test-ci (x86, 29, default) / Android Ubuntu Integration test (execute_sync_from_seed)
System.IO.IOException: No space left on device : '/home/runner/runners/2.322.0/_diag/Worker_20250219-025856-utc.log'
Unhandled exception. System.IO.IOException: No space left on device : '/home/runner/runners/2.322.0/_diag/Worker_20250219-025856-utc.log'
at System.IO.RandomAccess.WriteAtOffset(SafeFileHandle handle, ReadOnlySpan`1 buffer, Int64 fileOffset)
at System.IO.StreamWriter.Flush(Boolean flushStream, Boolean flushEncoder)
at System.Diagnostics.TextWriterTraceListener.Flush()
at System.Diagnostics.TraceSource.Flush()
at GitHub.Runner.Common.Tracing.Dispose(Boolean disposing)
at GitHub.Runner.Common.Tracing.Dispose()
at GitHub.Runner.Common.TraceManager.Dispose(Boolean disposing)
at GitHub.Runner.Common.TraceManager.Dispose()
at GitHub.Runner.Common.HostContext.Dispose(Boolean disposing)
at GitHub.Runner.Common.HostContext.Dispose()
at GitHub.Runner.Worker.Program.Main(String[] args)
at System.IO.RandomAccess.WriteAtOffset(SafeFileHandle handle, ReadOnlySpan`1 buffer, Int64 fileOffset)
at System.IO.StreamWriter.Flush(Boolean flushStream, Boolean flushEncoder)
at System.Diagnostics.TextWriterTraceListener.Flush()
at GitHub.Runner.Common.HostTraceListener.WriteHeader(String source, TraceEventType eventType, Int32 id)
at System.Diagnostics.TraceSource.TraceEvent(TraceEventType eventType, Int32 id, String message)
at GitHub.Runner.Worker.Worker.RunAsync(String pipeIn, String pipeOut)
at GitHub.Runner.Worker.Program.MainAsync(IHostContext context, String[] args)
System.IO.IOException: No space left on device : '/home/runner/runners/2.322.0/_diag/Worker_20250219-025856-utc.log'
at System.IO.RandomAccess.WriteAtOffset(SafeFileHandle handle, ReadOnlySpan`1 buffer, Int64 fileOffset)
at System.IO.StreamWriter.Flush(Boolean flushStream, Boolean flushEncoder)
at System.Diagnostics.TextWriterTraceListener.Flush()
at GitHub.Runner.Common.HostTraceListener.WriteHeader(String source, TraceEventType eventType, Int32 id)
at System.Diagnostics.TraceSource.TraceEvent(TraceEventType eventType, Int32 id, String message)
at GitHub.Runner.Common.Tracing.Error(Exception exception)
at GitHub.Runner.Worker.Program.MainAsync(IHostContext context, String[] args)
|
android-ubuntu-integration-test-ci (x86, 29, default) / Android Ubuntu Integration test (offline_testsuite)
System.IO.IOException: No space left on device : '/home/runner/runners/2.322.0/_diag/Worker_20250219-030432-utc.log'
at System.IO.RandomAccess.WriteAtOffset(SafeFileHandle handle, ReadOnlySpan`1 buffer, Int64 fileOffset)
at System.IO.StreamWriter.Flush(Boolean flushStream, Boolean flushEncoder)
at System.Diagnostics.TextWriterTraceListener.Flush()
at GitHub.Runner.Common.HostTraceListener.WriteHeader(String source, TraceEventType eventType, Int32 id)
at System.Diagnostics.TraceSource.TraceEvent(TraceEventType eventType, Int32 id, String message)
at GitHub.Runner.Worker.Worker.RunAsync(String pipeIn, String pipeOut)
at GitHub.Runner.Worker.Program.MainAsync(IHostContext context, String[] args)
System.IO.IOException: No space left on device : '/home/runner/runners/2.322.0/_diag/Worker_20250219-030432-utc.log'
at System.IO.RandomAccess.WriteAtOffset(SafeFileHandle handle, ReadOnlySpan`1 buffer, Int64 fileOffset)
at System.IO.StreamWriter.Flush(Boolean flushStream, Boolean flushEncoder)
at System.Diagnostics.TextWriterTraceListener.Flush()
at GitHub.Runner.Common.HostTraceListener.WriteHeader(String source, TraceEventType eventType, Int32 id)
at System.Diagnostics.TraceSource.TraceEvent(TraceEventType eventType, Int32 id, String message)
at GitHub.Runner.Common.Tracing.Error(Exception exception)
at GitHub.Runner.Worker.Program.MainAsync(IHostContext context, String[] args)
Unhandled exception. System.IO.IOException: No space left on device : '/home/runner/runners/2.322.0/_diag/Worker_20250219-030432-utc.log'
at System.IO.RandomAccess.WriteAtOffset(SafeFileHandle handle, ReadOnlySpan`1 buffer, Int64 fileOffset)
at System.IO.StreamWriter.Flush(Boolean flushStream, Boolean flushEncoder)
at System.Diagnostics.TextWriterTraceListener.Flush()
at System.Diagnostics.TraceSource.Flush()
at GitHub.Runner.Common.Tracing.Dispose(Boolean disposing)
at GitHub.Runner.Common.Tracing.Dispose()
at GitHub.Runner.Common.TraceManager.Dispose(Boolean disposing)
at GitHub.Runner.Common.TraceManager.Dispose()
at GitHub.Runner.Common.HostContext.Dispose(Boolean disposing)
at GitHub.Runner.Common.HostContext.Dispose()
at GitHub.Runner.Worker.Program.Main(String[] args)
|
android-ubuntu-integration-test-ci (x86_64, 34, default) / Android Ubuntu Integration test (offline_testsuite)
FailFast: cancelling since parallel instance has failed
|
android-ubuntu-integration-test-ci (x86_64, 34, default) / Android Ubuntu Integration test (offline_testsuite)
The operation was canceled.
|
android-ubuntu-integration-test-ci (x86_64, 34, default) / Android Ubuntu Integration test (execute_sapling_balance_from_seed)
FailFast: cancelling since parallel instance has failed
|
|
android-ubuntu-integration-test-ci (x86_64, 34, default) / Android Ubuntu Integration test (execute_parse_addresses)
FailFast: cancelling since parallel instance has failed
|
|
android-ubuntu-integration-test-ci (x86_64, 34, default) / Android Ubuntu Integration test (execute_send_from_orchard)
FailFast: cancelling since parallel instance has failed
|
|
android-ubuntu-integration-test-ci (x86_64, 34, default) / Android Ubuntu Integration test (execute_currentprice_and_value_transfers_from_seed)
FailFast: cancelling since parallel instance has failed
|
|
android-ubuntu-integration-test-ci (x86_64, 34, default) / Android Ubuntu Integration test (execute_sync_from_seed)
FailFast: cancelling since parallel instance has failed
|
|
ios-integration-test / IOS Integration test
Attempt 1 failed. Reason: Child_process exited with error code 65
|
ios-integration-test / IOS Integration test
Attempt 2 failed. Reason: Child_process exited with error code 65
|
android-ubuntu-integration-test-ci (x86, 29, default) / Android Ubuntu Integration test (execute_sapling_balance_from_seed)
You are running out of disk space. The runner will stop working when the machine runs out of disk space. Free space left: 12 MB
|
android-ubuntu-e2e-test-ci (x86, 28, default) / Android Ubuntu e2e test (change_custom_regtest_server)
Cache not found for keys: v0-rust-android-ubuntu-e2e-test-ci-Linux-6be15664-da39a3ee, v0-rust-android-ubuntu-e2e-test-ci-Linux-6be15664
|
android-ubuntu-e2e-test-ci (x86, 28, default) / Android Ubuntu e2e test (change_custom_regtest_server)
No files were found with the provided path: android/app/build/outputs/e2e_test_reports. No artifacts will be uploaded.
|
android-ubuntu-e2e-test-ci (x86, 28, default) / Android Ubuntu e2e test (change_custom_regtest_server)
Cache not found for keys: v0-rust-android-ubuntu-e2e-test-ci-Linux-6be15664-5abf5f57, v0-rust-android-ubuntu-e2e-test-ci-Linux-6be15664
|
android-ubuntu-e2e-test-ci (x86, 28, default) / Android Ubuntu e2e test (sync_report)
Cache not found for keys: v0-rust-android-ubuntu-e2e-test-ci-Linux-6be15664-da39a3ee, v0-rust-android-ubuntu-e2e-test-ci-Linux-6be15664
|
android-ubuntu-e2e-test-ci (x86, 28, default) / Android Ubuntu e2e test (sync_report)
Cache not found for keys: v0-rust-android-ubuntu-e2e-test-ci-Linux-6be15664-5abf5f57, v0-rust-android-ubuntu-e2e-test-ci-Linux-6be15664
|
android-ubuntu-e2e-test-ci (x86, 28, default) / Android Ubuntu e2e test (sync_report)
No files were found with the provided path: android/app/build/outputs/e2e_test_reports. No artifacts will be uploaded.
|
android-ubuntu-e2e-test-ci (x86, 28, default) / Android Ubuntu e2e test (sync_report)
You are running out of disk space. The runner will stop working when the machine runs out of disk space. Free space left: 6 MB
|
android-ubuntu-e2e-test-ci (x86, 28, default) / Android Ubuntu e2e test (send)
Cache not found for keys: v0-rust-android-ubuntu-e2e-test-ci-Linux-6be15664-da39a3ee, v0-rust-android-ubuntu-e2e-test-ci-Linux-6be15664
|
android-ubuntu-e2e-test-ci (x86, 28, default) / Android Ubuntu e2e test (send)
Cache not found for keys: v0-rust-android-ubuntu-e2e-test-ci-Linux-6be15664-5abf5f57, v0-rust-android-ubuntu-e2e-test-ci-Linux-6be15664
|
android-ubuntu-e2e-test-ci (x86, 28, default) / Android Ubuntu e2e test (send)
You are running out of disk space. The runner will stop working when the machine runs out of disk space. Free space left: 19 MB
|
android-ubuntu-e2e-test-ci (x86, 28, default) / Android Ubuntu e2e test (send)
No files were found with the provided path: android/app/build/outputs/e2e_test_reports. No artifacts will be uploaded.
|
android-ubuntu-e2e-test-ci (x86, 28, default) / Android Ubuntu e2e test (shielding)
Cache not found for keys: v0-rust-android-ubuntu-e2e-test-ci-Linux-6be15664-da39a3ee, v0-rust-android-ubuntu-e2e-test-ci-Linux-6be15664
|
android-ubuntu-e2e-test-ci (x86, 28, default) / Android Ubuntu e2e test (shielding)
No files were found with the provided path: android/app/build/outputs/e2e_test_reports. No artifacts will be uploaded.
|
android-ubuntu-e2e-test-ci (x86, 28, default) / Android Ubuntu e2e test (shielding)
Cache not found for keys: v0-rust-android-ubuntu-e2e-test-ci-Linux-6be15664-5abf5f57, v0-rust-android-ubuntu-e2e-test-ci-Linux-6be15664
|
android-ubuntu-e2e-test-ci (x86, 28, default) / Android Ubuntu e2e test (screen_awake)
Cache not found for keys: v0-rust-android-ubuntu-e2e-test-ci-Linux-6be15664-da39a3ee, v0-rust-android-ubuntu-e2e-test-ci-Linux-6be15664
|
android-ubuntu-e2e-test-ci (x86, 28, default) / Android Ubuntu e2e test (screen_awake)
Cache not found for keys: v0-rust-android-ubuntu-e2e-test-ci-Linux-6be15664-5abf5f57, v0-rust-android-ubuntu-e2e-test-ci-Linux-6be15664
|
android-ubuntu-e2e-test-ci (x86, 28, default) / Android Ubuntu e2e test (screen_awake)
No files were found with the provided path: android/app/build/outputs/e2e_test_reports. No artifacts will be uploaded.
|
android-ubuntu-e2e-test-ci (x86, 28, default) / Android Ubuntu e2e test (change_server_from_list)
You are running out of disk space. The runner will stop working when the machine runs out of disk space. Free space left: 58 MB
|
android-ubuntu-e2e-test-ci (x86, 28, default) / Android Ubuntu e2e test (change_server_from_list)
Cache not found for keys: v0-rust-android-ubuntu-e2e-test-ci-Linux-6be15664-5abf5f57, v0-rust-android-ubuntu-e2e-test-ci-Linux-6be15664
|
android-ubuntu-e2e-test-ci (x86, 28, default) / Android Ubuntu e2e test (reload_while_tx_pending)
Cache not found for keys: v0-rust-android-ubuntu-e2e-test-ci-Linux-6be15664-da39a3ee, v0-rust-android-ubuntu-e2e-test-ci-Linux-6be15664
|
android-ubuntu-e2e-test-ci (x86, 28, default) / Android Ubuntu e2e test (reload_while_tx_pending)
No files were found with the provided path: android/app/build/outputs/e2e_test_reports. No artifacts will be uploaded.
|
android-ubuntu-e2e-test-ci (x86, 28, default) / Android Ubuntu e2e test (reload_while_tx_pending)
Cache not found for keys: v0-rust-android-ubuntu-e2e-test-ci-Linux-6be15664-5abf5f57, v0-rust-android-ubuntu-e2e-test-ci-Linux-6be15664
|
android-ubuntu-e2e-test-ci (x86, 28, default) / Android Ubuntu e2e test (change_custom_server)
Cache not found for keys: v0-rust-android-ubuntu-e2e-test-ci-Linux-6be15664-5abf5f57, v0-rust-android-ubuntu-e2e-test-ci-Linux-6be15664
|
android-ubuntu-e2e-test-ci (x86, 28, default) / Android Ubuntu e2e test (new_wallet)
Cache not found for keys: v0-rust-android-ubuntu-e2e-test-ci-Linux-6be15664-da39a3ee, v0-rust-android-ubuntu-e2e-test-ci-Linux-6be15664
|
android-ubuntu-e2e-test-ci (x86, 28, default) / Android Ubuntu e2e test (new_wallet)
Cache not found for keys: v0-rust-android-ubuntu-e2e-test-ci-Linux-6be15664-5abf5f57, v0-rust-android-ubuntu-e2e-test-ci-Linux-6be15664
|
android-ubuntu-e2e-test-ci (x86, 28, default) / Android Ubuntu e2e test (new_wallet)
No files were found with the provided path: android/app/build/outputs/e2e_test_reports. No artifacts will be uploaded.
|
android-ubuntu-e2e-test-ci (x86, 28, default) / Android Ubuntu e2e test (transaction_history)
Cache not found for keys: v0-rust-android-ubuntu-e2e-test-ci-Linux-6be15664-da39a3ee, v0-rust-android-ubuntu-e2e-test-ci-Linux-6be15664
|
android-ubuntu-e2e-test-ci (x86, 28, default) / Android Ubuntu e2e test (transaction_history)
Cache not found for keys: v0-rust-android-ubuntu-e2e-test-ci-Linux-6be15664-5abf5f57, v0-rust-android-ubuntu-e2e-test-ci-Linux-6be15664
|
android-ubuntu-e2e-test-ci (x86, 28, default) / Android Ubuntu e2e test (transaction_history)
No files were found with the provided path: android/app/build/outputs/e2e_test_reports. No artifacts will be uploaded.
|
android-ubuntu-e2e-test-ci (x86, 28, default) / Android Ubuntu e2e test (tex_send_address)
Cache not found for keys: v0-rust-android-ubuntu-e2e-test-ci-Linux-6be15664-da39a3ee, v0-rust-android-ubuntu-e2e-test-ci-Linux-6be15664
|
android-ubuntu-e2e-test-ci (x86, 28, default) / Android Ubuntu e2e test (tex_send_address)
Cache not found for keys: v0-rust-android-ubuntu-e2e-test-ci-Linux-6be15664-5abf5f57, v0-rust-android-ubuntu-e2e-test-ci-Linux-6be15664
|
android-ubuntu-e2e-test-ci (x86, 28, default) / Android Ubuntu e2e test (tex_send_address)
No files were found with the provided path: android/app/build/outputs/e2e_test_reports. No artifacts will be uploaded.
|
android-ubuntu-e2e-test-ci (x86, 28, default) / Android Ubuntu e2e test (tex_send_address)
You are running out of disk space. The runner will stop working when the machine runs out of disk space. Free space left: 50 MB
|
android-ubuntu-e2e-test-ci (x86, 28, default) / Android Ubuntu e2e test (parse_invalid_address)
Cache not found for keys: v0-rust-android-ubuntu-e2e-test-ci-Linux-6be15664-da39a3ee, v0-rust-android-ubuntu-e2e-test-ci-Linux-6be15664
|
android-ubuntu-e2e-test-ci (x86, 28, default) / Android Ubuntu e2e test (parse_invalid_address)
You are running out of disk space. The runner will stop working when the machine runs out of disk space. Free space left: 5 MB
|
android-ubuntu-e2e-test-ci (x86, 28, default) / Android Ubuntu e2e test (parse_invalid_address)
No files were found with the provided path: android/app/build/outputs/e2e_test_reports. No artifacts will be uploaded.
|
android-ubuntu-e2e-test-ci (x86, 28, default) / Android Ubuntu e2e test (parse_invalid_address)
Cache not found for keys: v0-rust-android-ubuntu-e2e-test-ci-Linux-6be15664-5abf5f57, v0-rust-android-ubuntu-e2e-test-ci-Linux-6be15664
|
android-ubuntu-e2e-test-ci (x86, 28, default) / Android Ubuntu e2e test (change_custom_testnet_server)
Cache not found for keys: v0-rust-android-ubuntu-e2e-test-ci-Linux-6be15664-da39a3ee, v0-rust-android-ubuntu-e2e-test-ci-Linux-6be15664
|
android-ubuntu-e2e-test-ci (x86, 28, default) / Android Ubuntu e2e test (change_custom_testnet_server)
No files were found with the provided path: android/app/build/outputs/e2e_test_reports. No artifacts will be uploaded.
|
android-ubuntu-e2e-test-ci (x86, 28, default) / Android Ubuntu e2e test (change_custom_testnet_server)
Cache not found for keys: v0-rust-android-ubuntu-e2e-test-ci-Linux-6be15664-5abf5f57, v0-rust-android-ubuntu-e2e-test-ci-Linux-6be15664
|
android-ubuntu-e2e-test-ci (x86_64, 30, default) / Android Ubuntu e2e test (reload_while_tx_pending)
Cache not found for keys: v0-rust-android-ubuntu-e2e-test-ci-Linux-6be15664-5abf5f57, v0-rust-android-ubuntu-e2e-test-ci-Linux-6be15664
|
android-ubuntu-e2e-test-ci (x86_64, 30, default) / Android Ubuntu e2e test (tex_send_address)
Cache not found for keys: v0-rust-android-ubuntu-e2e-test-ci-Linux-6be15664-5abf5f57, v0-rust-android-ubuntu-e2e-test-ci-Linux-6be15664
|
android-ubuntu-e2e-test-ci (x86_64, 30, default) / Android Ubuntu e2e test (change_custom_testnet_server)
Cache not found for keys: v0-rust-android-ubuntu-e2e-test-ci-Linux-6be15664-5abf5f57, v0-rust-android-ubuntu-e2e-test-ci-Linux-6be15664
|
android-ubuntu-e2e-test-ci (x86_64, 30, default) / Android Ubuntu e2e test (new_wallet)
Cache not found for keys: v0-rust-android-ubuntu-e2e-test-ci-Linux-6be15664-5abf5f57, v0-rust-android-ubuntu-e2e-test-ci-Linux-6be15664
|
android-ubuntu-e2e-test-ci (x86_64, 30, default) / Android Ubuntu e2e test (shielding)
Cache not found for keys: v0-rust-android-ubuntu-e2e-test-ci-Linux-6be15664-5abf5f57, v0-rust-android-ubuntu-e2e-test-ci-Linux-6be15664
|
android-ubuntu-e2e-test-ci (x86_64, 30, default) / Android Ubuntu e2e test (transaction_history)
Cache not found for keys: v0-rust-android-ubuntu-e2e-test-ci-Linux-6be15664-5abf5f57, v0-rust-android-ubuntu-e2e-test-ci-Linux-6be15664
|
android-ubuntu-e2e-test-ci (x86_64, 30, default) / Android Ubuntu e2e test (screen_awake)
Cache not found for keys: v0-rust-android-ubuntu-e2e-test-ci-Linux-6be15664-5abf5f57, v0-rust-android-ubuntu-e2e-test-ci-Linux-6be15664
|
android-ubuntu-e2e-test-ci (x86_64, 30, default) / Android Ubuntu e2e test (parse_invalid_address)
Cache not found for keys: v0-rust-android-ubuntu-e2e-test-ci-Linux-6be15664-5abf5f57, v0-rust-android-ubuntu-e2e-test-ci-Linux-6be15664
|
android-ubuntu-e2e-test-ci (x86_64, 30, default) / Android Ubuntu e2e test (send)
Cache not found for keys: v0-rust-android-ubuntu-e2e-test-ci-Linux-6be15664-5abf5f57, v0-rust-android-ubuntu-e2e-test-ci-Linux-6be15664
|
android-ubuntu-e2e-test-ci (x86_64, 30, default) / Android Ubuntu e2e test (change_custom_regtest_server)
Cache not found for keys: v0-rust-android-ubuntu-e2e-test-ci-Linux-6be15664-5abf5f57, v0-rust-android-ubuntu-e2e-test-ci-Linux-6be15664
|
android-ubuntu-e2e-test-ci (x86_64, 30, default) / Android Ubuntu e2e test (change_server_from_list)
Cache not found for keys: v0-rust-android-ubuntu-e2e-test-ci-Linux-6be15664-5abf5f57, v0-rust-android-ubuntu-e2e-test-ci-Linux-6be15664
|
android-ubuntu-e2e-test-ci (x86_64, 30, default) / Android Ubuntu e2e test (sync_report)
Cache not found for keys: v0-rust-android-ubuntu-e2e-test-ci-Linux-6be15664-5abf5f57, v0-rust-android-ubuntu-e2e-test-ci-Linux-6be15664
|
android-ubuntu-e2e-test-ci (x86_64, 30, default) / Android Ubuntu e2e test (change_custom_server)
Cache not found for keys: v0-rust-android-ubuntu-e2e-test-ci-Linux-6be15664-5abf5f57, v0-rust-android-ubuntu-e2e-test-ci-Linux-6be15664
|