Skip to content

Merge pull request #777 from dorianvp/bump_rn_0.75.5 #4132

Merge pull request #777 from dorianvp/bump_rn_0.75.5

Merge pull request #777 from dorianvp/bump_rn_0.75.5 #4132

Triggered via push February 18, 2025 19:04
Status Cancelled
Total duration 31m 6s
Artifacts

ci.yaml

on: push
create-timestamp  /  Create timestamp
3s
create-timestamp / Create timestamp
create-cache-key  /  Create cache key
7s
create-cache-key / Create cache key
Matrix: android-build
ios-build  /  Check build cache
7s
ios-build / Check build cache
Matrix: android-ubuntu-e2e-test-ci
Matrix: android-ubuntu-integration-test-ci
ios-build  /  Build native rust & swift uniffi
0s
ios-build / Build native rust & swift uniffi
ios-build  /  Cache native rust
0s
ios-build / Cache native rust
ios-integration-test  /  IOS Integration test
30m 15s
ios-integration-test / IOS Integration test
Fit to window
Zoom out
Zoom in

Annotations

39 errors and 291 warnings
android-ubuntu-integration-test-ci (x86, 29, default) / Android Ubuntu Integration test (execute_currentprice_and_value_transfers_from_seed)
System.IO.IOException: No space left on device : '/home/runner/runners/2.322.0/_diag/Worker_20250218-190606-utc.log' at System.IO.RandomAccess.WriteAtOffset(SafeFileHandle handle, ReadOnlySpan`1 buffer, Int64 fileOffset) at System.IO.StreamWriter.Flush(Boolean flushStream, Boolean flushEncoder) at System.Diagnostics.TextWriterTraceListener.Flush() at GitHub.Runner.Common.HostTraceListener.WriteHeader(String source, TraceEventType eventType, Int32 id) at System.Diagnostics.TraceSource.TraceEvent(TraceEventType eventType, Int32 id, String message) at GitHub.Runner.Worker.Worker.RunAsync(String pipeIn, String pipeOut) at GitHub.Runner.Worker.Program.MainAsync(IHostContext context, String[] args) System.IO.IOException: No space left on device : '/home/runner/runners/2.322.0/_diag/Worker_20250218-190606-utc.log' at System.IO.RandomAccess.WriteAtOffset(SafeFileHandle handle, ReadOnlySpan`1 buffer, Int64 fileOffset) at System.IO.StreamWriter.Flush(Boolean flushStream, Boolean flushEncoder) at System.Diagnostics.TextWriterTraceListener.Flush() at GitHub.Runner.Common.HostTraceListener.WriteHeader(String source, TraceEventType eventType, Int32 id) at System.Diagnostics.TraceSource.TraceEvent(TraceEventType eventType, Int32 id, String message) at GitHub.Runner.Common.Tracing.Error(Exception exception) at GitHub.Runner.Worker.Program.MainAsync(IHostContext context, String[] args) Unhandled exception. System.IO.IOException: No space left on device : '/home/runner/runners/2.322.0/_diag/Worker_20250218-190606-utc.log' at System.IO.RandomAccess.WriteAtOffset(SafeFileHandle handle, ReadOnlySpan`1 buffer, Int64 fileOffset) at System.IO.StreamWriter.Flush(Boolean flushStream, Boolean flushEncoder) at System.Diagnostics.TextWriterTraceListener.Flush() at System.Diagnostics.TraceSource.Flush() at GitHub.Runner.Common.Tracing.Dispose(Boolean disposing) at GitHub.Runner.Common.Tracing.Dispose() at GitHub.Runner.Common.TraceManager.Dispose(Boolean disposing) at GitHub.Runner.Common.TraceManager.Dispose() at GitHub.Runner.Common.HostContext.Dispose(Boolean disposing) at GitHub.Runner.Common.HostContext.Dispose() at GitHub.Runner.Worker.Program.Main(String[] args)
android-ubuntu-integration-test-ci (x86, 29, default) / Android Ubuntu Integration test (execute_sync_from_seed)
Unhandled exception. System.IO.IOException: No space left on device : '/home/runner/runners/2.322.0/_diag/Worker_20250218-190606-utc.log' at System.IO.RandomAccess.WriteAtOffset(SafeFileHandle handle, ReadOnlySpan`1 buffer, Int64 fileOffset) at System.IO.StreamWriter.Flush(Boolean flushStream, Boolean flushEncoder) at System.Diagnostics.TextWriterTraceListener.Flush() at System.Diagnostics.TraceSource.Flush() at GitHub.Runner.Common.Tracing.Dispose(Boolean disposing) at GitHub.Runner.Common.Tracing.Dispose() at GitHub.Runner.Common.TraceManager.Dispose(Boolean disposing) at GitHub.Runner.Common.TraceManager.Dispose() at GitHub.Runner.Common.HostContext.Dispose(Boolean disposing) at GitHub.Runner.Common.HostContext.Dispose() at GitHub.Runner.Worker.Program.Main(String[] args) System.IO.IOException: No space left on device : '/home/runner/runners/2.322.0/_diag/Worker_20250218-190606-utc.log' at System.IO.RandomAccess.WriteAtOffset(SafeFileHandle handle, ReadOnlySpan`1 buffer, Int64 fileOffset) at System.IO.StreamWriter.Flush(Boolean flushStream, Boolean flushEncoder) at System.Diagnostics.TextWriterTraceListener.Flush() at GitHub.Runner.Common.HostTraceListener.WriteHeader(String source, TraceEventType eventType, Int32 id) at System.Diagnostics.TraceSource.TraceEvent(TraceEventType eventType, Int32 id, String message) at GitHub.Runner.Worker.Worker.RunAsync(String pipeIn, String pipeOut) at GitHub.Runner.Worker.Program.MainAsync(IHostContext context, String[] args) System.IO.IOException: No space left on device : '/home/runner/runners/2.322.0/_diag/Worker_20250218-190606-utc.log' at System.IO.RandomAccess.WriteAtOffset(SafeFileHandle handle, ReadOnlySpan`1 buffer, Int64 fileOffset) at System.IO.StreamWriter.Flush(Boolean flushStream, Boolean flushEncoder) at System.Diagnostics.TextWriterTraceListener.Flush() at GitHub.Runner.Common.HostTraceListener.WriteHeader(String source, TraceEventType eventType, Int32 id) at System.Diagnostics.TraceSource.TraceEvent(TraceEventType eventType, Int32 id, String message) at GitHub.Runner.Common.Tracing.Error(Exception exception) at GitHub.Runner.Worker.Program.MainAsync(IHostContext context, String[] args)
android-ubuntu-integration-test-ci (x86, 29, default) / Android Ubuntu Integration test (execute_send_from_orchard)
System.IO.IOException: No space left on device : '/home/runner/runners/2.322.0/_diag/Worker_20250218-190607-utc.log' at System.IO.RandomAccess.WriteAtOffset(SafeFileHandle handle, ReadOnlySpan`1 buffer, Int64 fileOffset) at System.IO.StreamWriter.Flush(Boolean flushStream, Boolean flushEncoder) at System.Diagnostics.TextWriterTraceListener.Flush() at GitHub.Runner.Common.HostTraceListener.WriteHeader(String source, TraceEventType eventType, Int32 id) at System.Diagnostics.TraceSource.TraceEvent(TraceEventType eventType, Int32 id, String message) at GitHub.Runner.Worker.Worker.RunAsync(String pipeIn, String pipeOut) at GitHub.Runner.Worker.Program.MainAsync(IHostContext context, String[] args) System.IO.IOException: No space left on device : '/home/runner/runners/2.322.0/_diag/Worker_20250218-190607-utc.log' at System.IO.RandomAccess.WriteAtOffset(SafeFileHandle handle, ReadOnlySpan`1 buffer, Int64 fileOffset) at System.IO.StreamWriter.Flush(Boolean flushStream, Boolean flushEncoder) at System.Diagnostics.TextWriterTraceListener.Flush() at GitHub.Runner.Common.HostTraceListener.WriteHeader(String source, TraceEventType eventType, Int32 id) at System.Diagnostics.TraceSource.TraceEvent(TraceEventType eventType, Int32 id, String message) at GitHub.Runner.Common.Tracing.Error(Exception exception) at GitHub.Runner.Worker.Program.MainAsync(IHostContext context, String[] args) Unhandled exception. System.IO.IOException: No space left on device : '/home/runner/runners/2.322.0/_diag/Worker_20250218-190607-utc.log' at System.IO.RandomAccess.WriteAtOffset(SafeFileHandle handle, ReadOnlySpan`1 buffer, Int64 fileOffset) at System.IO.StreamWriter.Flush(Boolean flushStream, Boolean flushEncoder) at System.Diagnostics.TextWriterTraceListener.Flush() at System.Diagnostics.TraceSource.Flush() at GitHub.Runner.Common.Tracing.Dispose(Boolean disposing) at GitHub.Runner.Common.Tracing.Dispose() at GitHub.Runner.Common.TraceManager.Dispose(Boolean disposing) at GitHub.Runner.Common.TraceManager.Dispose() at GitHub.Runner.Common.HostContext.Dispose(Boolean disposing) at GitHub.Runner.Common.HostContext.Dispose() at GitHub.Runner.Worker.Program.Main(String[] args)
android-ubuntu-integration-test-ci (x86, 29, default) / Android Ubuntu Integration test (execute_parse_addresses)
System.IO.IOException: No space left on device : '/home/runner/runners/2.322.0/_diag/Worker_20250218-190606-utc.log' at System.IO.RandomAccess.WriteAtOffset(SafeFileHandle handle, ReadOnlySpan`1 buffer, Int64 fileOffset) at System.IO.StreamWriter.Flush(Boolean flushStream, Boolean flushEncoder) at System.Diagnostics.TextWriterTraceListener.Flush() at GitHub.Runner.Common.HostTraceListener.WriteHeader(String source, TraceEventType eventType, Int32 id) at System.Diagnostics.TraceSource.TraceEvent(TraceEventType eventType, Int32 id, String message) at GitHub.Runner.Worker.Worker.RunAsync(String pipeIn, String pipeOut) at GitHub.Runner.Worker.Program.MainAsync(IHostContext context, String[] args) System.IO.IOException: No space left on device : '/home/runner/runners/2.322.0/_diag/Worker_20250218-190606-utc.log' at System.IO.RandomAccess.WriteAtOffset(SafeFileHandle handle, ReadOnlySpan`1 buffer, Int64 fileOffset) at System.IO.StreamWriter.Flush(Boolean flushStream, Boolean flushEncoder) at System.Diagnostics.TextWriterTraceListener.Flush() at GitHub.Runner.Common.HostTraceListener.WriteHeader(String source, TraceEventType eventType, Int32 id) at System.Diagnostics.TraceSource.TraceEvent(TraceEventType eventType, Int32 id, String message) at GitHub.Runner.Common.Tracing.Error(Exception exception) at GitHub.Runner.Worker.Program.MainAsync(IHostContext context, String[] args) Unhandled exception. System.IO.IOException: No space left on device : '/home/runner/runners/2.322.0/_diag/Worker_20250218-190606-utc.log' at System.IO.RandomAccess.WriteAtOffset(SafeFileHandle handle, ReadOnlySpan`1 buffer, Int64 fileOffset) at System.IO.StreamWriter.Flush(Boolean flushStream, Boolean flushEncoder) at System.Diagnostics.TextWriterTraceListener.Flush() at System.Diagnostics.TraceSource.Flush() at GitHub.Runner.Common.Tracing.Dispose(Boolean disposing) at GitHub.Runner.Common.Tracing.Dispose() at GitHub.Runner.Common.TraceManager.Dispose(Boolean disposing) at GitHub.Runner.Common.TraceManager.Dispose() at GitHub.Runner.Common.HostContext.Dispose(Boolean disposing) at GitHub.Runner.Common.HostContext.Dispose() at GitHub.Runner.Worker.Program.Main(String[] args)
android-ubuntu-e2e-test-ci (x86_64, 30, default) / Android Ubuntu e2e test (send)
Process completed with exit code 1.
android-ubuntu-e2e-test-ci (x86, 28, default) / Android Ubuntu e2e test (send)
Process completed with exit code 1.
android-ubuntu-e2e-test-ci (x86, 28, default) / Android Ubuntu e2e test (new_wallet)
FailFast: cancelling since parallel instance has failed
android-ubuntu-integration-test-ci (x86, 29, default) / Android Ubuntu Integration test (offline_testsuite)
FailFast: cancelling since parallel instance has failed
android-ubuntu-integration-test-ci (x86_64, 34, default) / Android Ubuntu Integration test (execute_send_from_orchard)
Failed to save cache entry with path '/home/runner/.gradle/caches/8.8/generated-gradle-jars/gradle-api-8.8.jar' and key: gradle-generated-gradle-jars-v1-8b02b97fb417a75a34543e345c4e56f3: Error: Failed to CreateCacheEntry: Received non-retryable error: Failed request: (409) Conflict: cache entry with the same key, version, and scope already exists
android-ubuntu-integration-test-ci (x86_64, 34, default) / Android Ubuntu Integration test (execute_send_from_orchard)
Failed to save cache entry with path '/home/runner/.gradle/caches/jars-*/*/' and key: gradle-instrumented-jars-v1-4a30506eb0d948e967d0892fa5c45110: Error: Failed to CreateCacheEntry: Received non-retryable error: Failed request: (409) Conflict: cache entry with the same key, version, and scope already exists
android-ubuntu-integration-test-ci (x86_64, 34, default) / Android Ubuntu Integration test (execute_send_from_orchard)
Failed to save cache entry with path '/home/runner/.gradle/caches/*/kotlin-dsl/accessors/*/,/home/runner/.gradle/caches/*/kotlin-dsl/scripts/*/' and key: gradle-kotlin-dsl-v1-9140bde3d9d7a5883115b76f0a435441: Error: Failed to CreateCacheEntry: Received non-retryable error: Failed request: (409) Conflict: cache entry with the same key, version, and scope already exists
android-ubuntu-integration-test-ci (x86_64, 34, default) / Android Ubuntu Integration test (execute_send_from_orchard)
Failed to save cache entry with path '/home/runner/.gradle/caches/*/groovy-dsl/*/' and key: gradle-groovy-dsl-v1-910dbffcc305745a058a12e2e70374d3: Error: Failed to CreateCacheEntry: Received non-retryable error: Failed request: (409) Conflict: cache entry with the same key, version, and scope already exists
android-ubuntu-integration-test-ci (x86_64, 34, default) / Android Ubuntu Integration test (execute_send_from_orchard)
Failed to save cache entry with path '/home/runner/.gradle/wrapper/dists/gradle-8.8-all/6gdy1pgp427xkqcjbxw3ylt6h' and key: gradle-wrapper-zips-v1-3600859674b461a36bd4c8379d91f6cb: Error: Failed to CreateCacheEntry: Received non-retryable error: Failed request: (409) Conflict: cache entry with the same key, version, and scope already exists
android-ubuntu-integration-test-ci (x86_64, 34, default) / Android Ubuntu Integration test (execute_send_from_orchard)
Failed to save cache entry with path '/home/runner/.gradle/caches/modules-*/files-*/*/*/*/*' and key: gradle-dependencies-v1-04a3bf68ca15d37e2f817e3b20e56a5d: Error: Failed to CreateCacheEntry: Received non-retryable error: Failed request: (409) Conflict: cache entry with the same key, version, and scope already exists
android-ubuntu-integration-test-ci (x86_64, 34, default) / Android Ubuntu Integration test (execute_send_from_orchard)
Save Gradle distribution 8.8 failed: Error: Failed to CreateCacheEntry: Received non-retryable error: Failed request: (409) Conflict: cache entry with the same key, version, and scope already exists
android-ubuntu-integration-test-ci (x86_64, 34, default) / Android Ubuntu Integration test (execute_send_from_orchard)
No files were found with the provided path: android/app/build/outputs/integration_test_reports. No artifacts will be uploaded.
android-ubuntu-integration-test-ci (x86_64, 34, default) / Android Ubuntu Integration test (execute_currentprice_and_value_transfers_from_seed)
No files were found with the provided path: android/app/build/outputs/integration_test_reports. No artifacts will be uploaded.
android-ubuntu-integration-test-ci (x86_64, 34, default) / Android Ubuntu Integration test (execute_sapling_balance_from_seed)
Save Gradle distribution 8.8 failed: Error: Failed to CreateCacheEntry: Received non-retryable error: Failed request: (409) Conflict: cache entry with the same key, version, and scope already exists
android-ubuntu-integration-test-ci (x86_64, 34, default) / Android Ubuntu Integration test (execute_sapling_balance_from_seed)
Failed to save cache entry with path '/home/runner/.gradle/caches/8.8/generated-gradle-jars/gradle-api-8.8.jar' and key: gradle-generated-gradle-jars-v1-8b02b97fb417a75a34543e345c4e56f3: Error: Failed to CreateCacheEntry: Received non-retryable error: Failed request: (409) Conflict: cache entry with the same key, version, and scope already exists
android-ubuntu-integration-test-ci (x86_64, 34, default) / Android Ubuntu Integration test (execute_sapling_balance_from_seed)
Failed to save cache entry with path '/home/runner/.gradle/caches/jars-*/*/' and key: gradle-instrumented-jars-v1-4a30506eb0d948e967d0892fa5c45110: Error: Failed to CreateCacheEntry: Received non-retryable error: Failed request: (409) Conflict: cache entry with the same key, version, and scope already exists
android-ubuntu-integration-test-ci (x86_64, 34, default) / Android Ubuntu Integration test (execute_sapling_balance_from_seed)
Failed to save cache entry with path '/home/runner/.gradle/caches/*/kotlin-dsl/accessors/*/,/home/runner/.gradle/caches/*/kotlin-dsl/scripts/*/' and key: gradle-kotlin-dsl-v1-9140bde3d9d7a5883115b76f0a435441: Error: Failed to CreateCacheEntry: Received non-retryable error: Failed request: (409) Conflict: cache entry with the same key, version, and scope already exists
android-ubuntu-integration-test-ci (x86_64, 34, default) / Android Ubuntu Integration test (execute_sapling_balance_from_seed)
Failed to save cache entry with path '/home/runner/.gradle/caches/*/groovy-dsl/*/' and key: gradle-groovy-dsl-v1-910dbffcc305745a058a12e2e70374d3: Error: Failed to CreateCacheEntry: Received non-retryable error: Failed request: (409) Conflict: cache entry with the same key, version, and scope already exists
android-ubuntu-integration-test-ci (x86_64, 34, default) / Android Ubuntu Integration test (execute_sapling_balance_from_seed)
Failed to save cache entry with path '/home/runner/.gradle/wrapper/dists/gradle-8.8-all/6gdy1pgp427xkqcjbxw3ylt6h' and key: gradle-wrapper-zips-v1-3600859674b461a36bd4c8379d91f6cb: Error: Failed to CreateCacheEntry: Received non-retryable error: Failed request: (409) Conflict: cache entry with the same key, version, and scope already exists
android-ubuntu-integration-test-ci (x86_64, 34, default) / Android Ubuntu Integration test (execute_sapling_balance_from_seed)
Failed to save cache entry with path '/home/runner/.gradle/caches/modules-*/files-*/*/*/*/*' and key: gradle-dependencies-v1-04a3bf68ca15d37e2f817e3b20e56a5d: Error: Failed to CreateCacheEntry: Received non-retryable error: Failed request: (409) Conflict: cache entry with the same key, version, and scope already exists
android-ubuntu-integration-test-ci (x86_64, 34, default) / Android Ubuntu Integration test (execute_sapling_balance_from_seed)
No files were found with the provided path: android/app/build/outputs/integration_test_reports. No artifacts will be uploaded.
android-ubuntu-integration-test-ci (x86_64, 34, default) / Android Ubuntu Integration test (offline_testsuite)
Failed to save cache entry with path '/home/runner/.gradle/caches/8.8/generated-gradle-jars/gradle-api-8.8.jar' and key: gradle-generated-gradle-jars-v1-8b02b97fb417a75a34543e345c4e56f3: Error: Failed to CreateCacheEntry: Received non-retryable error: Failed request: (409) Conflict: cache entry with the same key, version, and scope already exists
android-ubuntu-integration-test-ci (x86_64, 34, default) / Android Ubuntu Integration test (offline_testsuite)
Failed to save cache entry with path '/home/runner/.gradle/caches/jars-*/*/' and key: gradle-instrumented-jars-v1-4a30506eb0d948e967d0892fa5c45110: Error: Failed to CreateCacheEntry: Received non-retryable error: Failed request: (409) Conflict: cache entry with the same key, version, and scope already exists
android-ubuntu-integration-test-ci (x86_64, 34, default) / Android Ubuntu Integration test (offline_testsuite)
Failed to save cache entry with path '/home/runner/.gradle/caches/*/kotlin-dsl/accessors/*/,/home/runner/.gradle/caches/*/kotlin-dsl/scripts/*/' and key: gradle-kotlin-dsl-v1-9140bde3d9d7a5883115b76f0a435441: Error: Failed to CreateCacheEntry: Received non-retryable error: Failed request: (409) Conflict: cache entry with the same key, version, and scope already exists
android-ubuntu-integration-test-ci (x86_64, 34, default) / Android Ubuntu Integration test (offline_testsuite)
Failed to save cache entry with path '/home/runner/.gradle/caches/*/groovy-dsl/*/' and key: gradle-groovy-dsl-v1-910dbffcc305745a058a12e2e70374d3: Error: Failed to CreateCacheEntry: Received non-retryable error: Failed request: (409) Conflict: cache entry with the same key, version, and scope already exists
android-ubuntu-integration-test-ci (x86_64, 34, default) / Android Ubuntu Integration test (offline_testsuite)
Failed to save cache entry with path '/home/runner/.gradle/wrapper/dists/gradle-8.8-all/6gdy1pgp427xkqcjbxw3ylt6h' and key: gradle-wrapper-zips-v1-3600859674b461a36bd4c8379d91f6cb: Error: Failed to CreateCacheEntry: Received non-retryable error: Failed request: (409) Conflict: cache entry with the same key, version, and scope already exists
android-ubuntu-integration-test-ci (x86_64, 34, default) / Android Ubuntu Integration test (offline_testsuite)
Failed to save cache entry with path '/home/runner/.gradle/caches/modules-*/files-*/*/*/*/*' and key: gradle-dependencies-v1-04a3bf68ca15d37e2f817e3b20e56a5d: Error: Failed to CreateCacheEntry: Received non-retryable error: Failed request: (409) Conflict: cache entry with the same key, version, and scope already exists
android-ubuntu-integration-test-ci (x86_64, 34, default) / Android Ubuntu Integration test (offline_testsuite)
No files were found with the provided path: android/app/build/outputs/integration_test_reports. No artifacts will be uploaded.
android-ubuntu-integration-test-ci (x86_64, 34, default) / Android Ubuntu Integration test (offline_testsuite)
Save Gradle distribution 8.8 failed: Error: Failed to CreateCacheEntry: Received non-retryable error: Failed request: (409) Conflict: cache entry with the same key, version, and scope already exists
android-ubuntu-e2e-test-ci (x86_64, 30, default) / Android Ubuntu e2e test (change_server_from_list)
Cache not found for keys: v0-rust-android-ubuntu-e2e-test-ci-Linux-6be15664-da39a3ee, v0-rust-android-ubuntu-e2e-test-ci-Linux-6be15664
android-ubuntu-e2e-test-ci (x86_64, 30, default) / Android Ubuntu e2e test (change_server_from_list)
No files were found with the provided path: android/app/build/outputs/e2e_test_reports. No artifacts will be uploaded.
android-ubuntu-e2e-test-ci (x86_64, 30, default) / Android Ubuntu e2e test (change_server_from_list)
Failed to save cache entry with path '/home/runner/.gradle/caches/8.8/generated-gradle-jars/gradle-api-8.8.jar' and key: gradle-generated-gradle-jars-v1-8b02b97fb417a75a34543e345c4e56f3: Error: Failed to CreateCacheEntry: Received non-retryable error: Failed request: (409) Conflict: cache entry with the same key, version, and scope already exists
android-ubuntu-e2e-test-ci (x86_64, 30, default) / Android Ubuntu e2e test (change_server_from_list)
Failed to save cache entry with path '/home/runner/.gradle/caches/jars-*/*/' and key: gradle-instrumented-jars-v1-4a30506eb0d948e967d0892fa5c45110: Error: Failed to CreateCacheEntry: Received non-retryable error: Failed request: (409) Conflict: cache entry with the same key, version, and scope already exists
android-ubuntu-e2e-test-ci (x86_64, 30, default) / Android Ubuntu e2e test (change_server_from_list)
Failed to save cache entry with path '/home/runner/.gradle/caches/*/kotlin-dsl/accessors/*/,/home/runner/.gradle/caches/*/kotlin-dsl/scripts/*/' and key: gradle-kotlin-dsl-v1-9140bde3d9d7a5883115b76f0a435441: Error: Failed to CreateCacheEntry: Received non-retryable error: Failed request: (409) Conflict: cache entry with the same key, version, and scope already exists
android-ubuntu-e2e-test-ci (x86_64, 30, default) / Android Ubuntu e2e test (change_server_from_list)
Failed to save cache entry with path '/home/runner/.gradle/caches/*/groovy-dsl/*/' and key: gradle-groovy-dsl-v1-910dbffcc305745a058a12e2e70374d3: Error: Failed to CreateCacheEntry: Received non-retryable error: Failed request: (409) Conflict: cache entry with the same key, version, and scope already exists
android-ubuntu-e2e-test-ci (x86_64, 30, default) / Android Ubuntu e2e test (change_server_from_list)
Failed to save cache entry with path '/home/runner/.gradle/wrapper/dists/gradle-8.8-all/6gdy1pgp427xkqcjbxw3ylt6h' and key: gradle-wrapper-zips-v1-3600859674b461a36bd4c8379d91f6cb: Error: Failed to CreateCacheEntry: Received non-retryable error: Failed request: (409) Conflict: cache entry with the same key, version, and scope already exists
android-ubuntu-e2e-test-ci (x86_64, 30, default) / Android Ubuntu e2e test (change_server_from_list)
Failed to save cache entry with path '/home/runner/.gradle/caches/modules-*/files-*/*/*/*/*' and key: gradle-dependencies-v1-04a3bf68ca15d37e2f817e3b20e56a5d: Error: Failed to CreateCacheEntry: Received non-retryable error: Failed request: (409) Conflict: cache entry with the same key, version, and scope already exists
android-ubuntu-e2e-test-ci (x86_64, 30, default) / Android Ubuntu e2e test (change_server_from_list)
Cache not found for keys: v0-rust-android-ubuntu-e2e-test-ci-Linux-6be15664-5abf5f57, v0-rust-android-ubuntu-e2e-test-ci-Linux-6be15664
android-ubuntu-e2e-test-ci (x86_64, 30, default) / Android Ubuntu e2e test (tex_send_address)
Cache not found for keys: v0-rust-android-ubuntu-e2e-test-ci-Linux-6be15664-da39a3ee, v0-rust-android-ubuntu-e2e-test-ci-Linux-6be15664
android-ubuntu-e2e-test-ci (x86_64, 30, default) / Android Ubuntu e2e test (tex_send_address)
Cache not found for keys: v0-rust-android-ubuntu-e2e-test-ci-Linux-6be15664-5abf5f57, v0-rust-android-ubuntu-e2e-test-ci-Linux-6be15664
android-ubuntu-e2e-test-ci (x86_64, 30, default) / Android Ubuntu e2e test (tex_send_address)
No files were found with the provided path: android/app/build/outputs/e2e_test_reports. No artifacts will be uploaded.
android-ubuntu-e2e-test-ci (x86_64, 30, default) / Android Ubuntu e2e test (tex_send_address)
Failed to save cache entry with path '/home/runner/.gradle/caches/8.8/generated-gradle-jars/gradle-api-8.8.jar' and key: gradle-generated-gradle-jars-v1-8b02b97fb417a75a34543e345c4e56f3: Error: Failed to CreateCacheEntry: Received non-retryable error: Failed request: (409) Conflict: cache entry with the same key, version, and scope already exists
android-ubuntu-e2e-test-ci (x86_64, 30, default) / Android Ubuntu e2e test (tex_send_address)
Failed to save cache entry with path '/home/runner/.gradle/caches/jars-*/*/' and key: gradle-instrumented-jars-v1-4a30506eb0d948e967d0892fa5c45110: Error: Failed to CreateCacheEntry: Received non-retryable error: Failed request: (409) Conflict: cache entry with the same key, version, and scope already exists
android-ubuntu-e2e-test-ci (x86_64, 30, default) / Android Ubuntu e2e test (tex_send_address)
Failed to save cache entry with path '/home/runner/.gradle/caches/*/kotlin-dsl/accessors/*/,/home/runner/.gradle/caches/*/kotlin-dsl/scripts/*/' and key: gradle-kotlin-dsl-v1-9140bde3d9d7a5883115b76f0a435441: Error: Failed to CreateCacheEntry: Received non-retryable error: Failed request: (409) Conflict: cache entry with the same key, version, and scope already exists
android-ubuntu-e2e-test-ci (x86_64, 30, default) / Android Ubuntu e2e test (tex_send_address)
Failed to save cache entry with path '/home/runner/.gradle/caches/*/groovy-dsl/*/' and key: gradle-groovy-dsl-v1-910dbffcc305745a058a12e2e70374d3: Error: Failed to CreateCacheEntry: Received non-retryable error: Failed request: (409) Conflict: cache entry with the same key, version, and scope already exists
android-ubuntu-e2e-test-ci (x86_64, 30, default) / Android Ubuntu e2e test (tex_send_address)
Failed to save cache entry with path '/home/runner/.gradle/wrapper/dists/gradle-8.8-all/6gdy1pgp427xkqcjbxw3ylt6h' and key: gradle-wrapper-zips-v1-3600859674b461a36bd4c8379d91f6cb: Error: Failed to CreateCacheEntry: Received non-retryable error: Failed request: (409) Conflict: cache entry with the same key, version, and scope already exists
android-ubuntu-e2e-test-ci (x86_64, 30, default) / Android Ubuntu e2e test (tex_send_address)
Failed to save cache entry with path '/home/runner/.gradle/caches/modules-*/files-*/*/*/*/*' and key: gradle-dependencies-v1-04a3bf68ca15d37e2f817e3b20e56a5d: Error: Failed to CreateCacheEntry: Received non-retryable error: Failed request: (409) Conflict: cache entry with the same key, version, and scope already exists
android-ubuntu-e2e-test-ci (x86, 28, default) / Android Ubuntu e2e test (screen_awake)
Cache not found for keys: v0-rust-android-ubuntu-e2e-test-ci-Linux-6be15664-da39a3ee, v0-rust-android-ubuntu-e2e-test-ci-Linux-6be15664
android-ubuntu-e2e-test-ci (x86, 28, default) / Android Ubuntu e2e test (screen_awake)
Failed to save cache entry with path '/home/runner/.gradle/caches/8.8/generated-gradle-jars/gradle-api-8.8.jar' and key: gradle-generated-gradle-jars-v1-8b02b97fb417a75a34543e345c4e56f3: Error: Failed to CreateCacheEntry: Received non-retryable error: Failed request: (409) Conflict: cache entry with the same key, version, and scope already exists
android-ubuntu-e2e-test-ci (x86, 28, default) / Android Ubuntu e2e test (screen_awake)
Failed to save cache entry with path '/home/runner/.gradle/caches/jars-*/*/' and key: gradle-instrumented-jars-v1-4a30506eb0d948e967d0892fa5c45110: Error: Failed to CreateCacheEntry: Received non-retryable error: Failed request: (409) Conflict: cache entry with the same key, version, and scope already exists
android-ubuntu-e2e-test-ci (x86, 28, default) / Android Ubuntu e2e test (screen_awake)
Failed to save cache entry with path '/home/runner/.gradle/caches/*/kotlin-dsl/accessors/*/,/home/runner/.gradle/caches/*/kotlin-dsl/scripts/*/' and key: gradle-kotlin-dsl-v1-9140bde3d9d7a5883115b76f0a435441: Error: Failed to CreateCacheEntry: Received non-retryable error: Failed request: (409) Conflict: cache entry with the same key, version, and scope already exists
android-ubuntu-e2e-test-ci (x86, 28, default) / Android Ubuntu e2e test (screen_awake)
Failed to save cache entry with path '/home/runner/.gradle/caches/*/groovy-dsl/*/' and key: gradle-groovy-dsl-v1-910dbffcc305745a058a12e2e70374d3: Error: Failed to CreateCacheEntry: Received non-retryable error: Failed request: (409) Conflict: cache entry with the same key, version, and scope already exists
android-ubuntu-e2e-test-ci (x86, 28, default) / Android Ubuntu e2e test (screen_awake)
Failed to save cache entry with path '/home/runner/.gradle/wrapper/dists/gradle-8.8-all/6gdy1pgp427xkqcjbxw3ylt6h' and key: gradle-wrapper-zips-v1-3600859674b461a36bd4c8379d91f6cb: Error: Failed to CreateCacheEntry: Received non-retryable error: Failed request: (409) Conflict: cache entry with the same key, version, and scope already exists
android-ubuntu-e2e-test-ci (x86, 28, default) / Android Ubuntu e2e test (screen_awake)
Failed to save cache entry with path '/home/runner/.gradle/caches/modules-*/files-*/*/*/*/*' and key: gradle-dependencies-v1-04a3bf68ca15d37e2f817e3b20e56a5d: Error: Failed to CreateCacheEntry: Received non-retryable error: Failed request: (409) Conflict: cache entry with the same key, version, and scope already exists
android-ubuntu-e2e-test-ci (x86, 28, default) / Android Ubuntu e2e test (screen_awake)
Cache not found for keys: v0-rust-android-ubuntu-e2e-test-ci-Linux-6be15664-5abf5f57, v0-rust-android-ubuntu-e2e-test-ci-Linux-6be15664
android-ubuntu-e2e-test-ci (x86, 28, default) / Android Ubuntu e2e test (screen_awake)
No files were found with the provided path: android/app/build/outputs/e2e_test_reports. No artifacts will be uploaded.
android-ubuntu-e2e-test-ci (x86, 28, default) / Android Ubuntu e2e test (change_custom_regtest_server)
Cache not found for keys: v0-rust-android-ubuntu-e2e-test-ci-Linux-6be15664-da39a3ee, v0-rust-android-ubuntu-e2e-test-ci-Linux-6be15664
android-ubuntu-e2e-test-ci (x86, 28, default) / Android Ubuntu e2e test (change_custom_regtest_server)
No files were found with the provided path: android/app/build/outputs/e2e_test_reports. No artifacts will be uploaded.
android-ubuntu-e2e-test-ci (x86, 28, default) / Android Ubuntu e2e test (change_custom_regtest_server)
Failed to save cache entry with path '/home/runner/.gradle/caches/8.8/generated-gradle-jars/gradle-api-8.8.jar' and key: gradle-generated-gradle-jars-v1-8b02b97fb417a75a34543e345c4e56f3: Error: Failed to CreateCacheEntry: Received non-retryable error: Failed request: (409) Conflict: cache entry with the same key, version, and scope already exists
android-ubuntu-e2e-test-ci (x86, 28, default) / Android Ubuntu e2e test (change_custom_regtest_server)
Failed to save cache entry with path '/home/runner/.gradle/caches/jars-*/*/' and key: gradle-instrumented-jars-v1-4a30506eb0d948e967d0892fa5c45110: Error: Failed to CreateCacheEntry: Received non-retryable error: Failed request: (409) Conflict: cache entry with the same key, version, and scope already exists
android-ubuntu-e2e-test-ci (x86, 28, default) / Android Ubuntu e2e test (change_custom_regtest_server)
Failed to save cache entry with path '/home/runner/.gradle/caches/*/kotlin-dsl/accessors/*/,/home/runner/.gradle/caches/*/kotlin-dsl/scripts/*/' and key: gradle-kotlin-dsl-v1-9140bde3d9d7a5883115b76f0a435441: Error: Failed to CreateCacheEntry: Received non-retryable error: Failed request: (409) Conflict: cache entry with the same key, version, and scope already exists
android-ubuntu-e2e-test-ci (x86, 28, default) / Android Ubuntu e2e test (change_custom_regtest_server)
Failed to save cache entry with path '/home/runner/.gradle/caches/*/groovy-dsl/*/' and key: gradle-groovy-dsl-v1-910dbffcc305745a058a12e2e70374d3: Error: Failed to CreateCacheEntry: Received non-retryable error: Failed request: (409) Conflict: cache entry with the same key, version, and scope already exists
android-ubuntu-e2e-test-ci (x86, 28, default) / Android Ubuntu e2e test (change_custom_regtest_server)
Failed to save cache entry with path '/home/runner/.gradle/wrapper/dists/gradle-8.8-all/6gdy1pgp427xkqcjbxw3ylt6h' and key: gradle-wrapper-zips-v1-3600859674b461a36bd4c8379d91f6cb: Error: Failed to CreateCacheEntry: Received non-retryable error: Failed request: (409) Conflict: cache entry with the same key, version, and scope already exists
android-ubuntu-e2e-test-ci (x86, 28, default) / Android Ubuntu e2e test (change_custom_regtest_server)
Failed to save cache entry with path '/home/runner/.gradle/caches/modules-*/files-*/*/*/*/*' and key: gradle-dependencies-v1-04a3bf68ca15d37e2f817e3b20e56a5d: Error: Failed to CreateCacheEntry: Received non-retryable error: Failed request: (409) Conflict: cache entry with the same key, version, and scope already exists
android-ubuntu-e2e-test-ci (x86, 28, default) / Android Ubuntu e2e test (change_custom_regtest_server)
Cache not found for keys: v0-rust-android-ubuntu-e2e-test-ci-Linux-6be15664-5abf5f57, v0-rust-android-ubuntu-e2e-test-ci-Linux-6be15664
android-ubuntu-e2e-test-ci (x86, 28, default) / Android Ubuntu e2e test (tex_send_address)
Cache not found for keys: v0-rust-android-ubuntu-e2e-test-ci-Linux-6be15664-da39a3ee, v0-rust-android-ubuntu-e2e-test-ci-Linux-6be15664
android-ubuntu-e2e-test-ci (x86, 28, default) / Android Ubuntu e2e test (tex_send_address)
Cache not found for keys: v0-rust-android-ubuntu-e2e-test-ci-Linux-6be15664-5abf5f57, v0-rust-android-ubuntu-e2e-test-ci-Linux-6be15664
android-ubuntu-e2e-test-ci (x86, 28, default) / Android Ubuntu e2e test (tex_send_address)
No files were found with the provided path: android/app/build/outputs/e2e_test_reports. No artifacts will be uploaded.
android-ubuntu-e2e-test-ci (x86, 28, default) / Android Ubuntu e2e test (tex_send_address)
Failed to save cache entry with path '/home/runner/.gradle/caches/8.8/generated-gradle-jars/gradle-api-8.8.jar' and key: gradle-generated-gradle-jars-v1-8b02b97fb417a75a34543e345c4e56f3: Error: Failed to CreateCacheEntry: Received non-retryable error: Failed request: (409) Conflict: cache entry with the same key, version, and scope already exists
android-ubuntu-e2e-test-ci (x86, 28, default) / Android Ubuntu e2e test (tex_send_address)
Failed to save cache entry with path '/home/runner/.gradle/caches/jars-*/*/' and key: gradle-instrumented-jars-v1-4a30506eb0d948e967d0892fa5c45110: Error: Failed to CreateCacheEntry: Received non-retryable error: Failed request: (409) Conflict: cache entry with the same key, version, and scope already exists
android-ubuntu-e2e-test-ci (x86, 28, default) / Android Ubuntu e2e test (tex_send_address)
Failed to save cache entry with path '/home/runner/.gradle/caches/*/kotlin-dsl/accessors/*/,/home/runner/.gradle/caches/*/kotlin-dsl/scripts/*/' and key: gradle-kotlin-dsl-v1-9140bde3d9d7a5883115b76f0a435441: Error: Failed to CreateCacheEntry: Received non-retryable error: Failed request: (409) Conflict: cache entry with the same key, version, and scope already exists
android-ubuntu-e2e-test-ci (x86, 28, default) / Android Ubuntu e2e test (tex_send_address)
Failed to save cache entry with path '/home/runner/.gradle/caches/*/groovy-dsl/*/' and key: gradle-groovy-dsl-v1-910dbffcc305745a058a12e2e70374d3: Error: Failed to CreateCacheEntry: Received non-retryable error: Failed request: (409) Conflict: cache entry with the same key, version, and scope already exists
android-ubuntu-e2e-test-ci (x86, 28, default) / Android Ubuntu e2e test (tex_send_address)
Failed to save cache entry with path '/home/runner/.gradle/wrapper/dists/gradle-8.8-all/6gdy1pgp427xkqcjbxw3ylt6h' and key: gradle-wrapper-zips-v1-3600859674b461a36bd4c8379d91f6cb: Error: Failed to CreateCacheEntry: Received non-retryable error: Failed request: (409) Conflict: cache entry with the same key, version, and scope already exists
android-ubuntu-e2e-test-ci (x86, 28, default) / Android Ubuntu e2e test (tex_send_address)
Failed to save cache entry with path '/home/runner/.gradle/caches/modules-*/files-*/*/*/*/*' and key: gradle-dependencies-v1-04a3bf68ca15d37e2f817e3b20e56a5d: Error: Failed to CreateCacheEntry: Received non-retryable error: Failed request: (409) Conflict: cache entry with the same key, version, and scope already exists
android-ubuntu-e2e-test-ci (x86, 28, default) / Android Ubuntu e2e test (tex_send_address)
Failed to save cache entry with path '/home/runner/.gradle/caches,/home/runner/.gradle/notifications,/home/runner/.gradle/.setup-gradle' and key: gradle-home-v1|Linux-X64|android-ubuntu-e2e-test-ci[c305761d13b8e5ce47580c2c54d7ae59]-38fa32f09c2ed2042771b3ff957deed0fbe48eb2: Error: Failed to CreateCacheEntry: Received non-retryable error: Failed request: (409) Conflict: cache entry with the same key, version, and scope already exists
android-ubuntu-e2e-test-ci (x86, 28, default) / Android Ubuntu e2e test (change_custom_server)
Cache not found for keys: v0-rust-android-ubuntu-e2e-test-ci-Linux-6be15664-da39a3ee, v0-rust-android-ubuntu-e2e-test-ci-Linux-6be15664
android-ubuntu-e2e-test-ci (x86, 28, default) / Android Ubuntu e2e test (change_custom_server)
Failed to save cache entry with path '/home/runner/.gradle/caches/8.8/generated-gradle-jars/gradle-api-8.8.jar' and key: gradle-generated-gradle-jars-v1-8b02b97fb417a75a34543e345c4e56f3: Error: Failed to CreateCacheEntry: Received non-retryable error: Failed request: (409) Conflict: cache entry with the same key, version, and scope already exists
android-ubuntu-e2e-test-ci (x86, 28, default) / Android Ubuntu e2e test (change_custom_server)
Failed to save cache entry with path '/home/runner/.gradle/caches/jars-*/*/' and key: gradle-instrumented-jars-v1-4a30506eb0d948e967d0892fa5c45110: Error: Failed to CreateCacheEntry: Received non-retryable error: Failed request: (409) Conflict: cache entry with the same key, version, and scope already exists
android-ubuntu-e2e-test-ci (x86, 28, default) / Android Ubuntu e2e test (change_custom_server)
Failed to save cache entry with path '/home/runner/.gradle/caches/*/kotlin-dsl/accessors/*/,/home/runner/.gradle/caches/*/kotlin-dsl/scripts/*/' and key: gradle-kotlin-dsl-v1-9140bde3d9d7a5883115b76f0a435441: Error: Failed to CreateCacheEntry: Received non-retryable error: Failed request: (409) Conflict: cache entry with the same key, version, and scope already exists
android-ubuntu-e2e-test-ci (x86, 28, default) / Android Ubuntu e2e test (change_custom_server)
Failed to save cache entry with path '/home/runner/.gradle/caches/*/groovy-dsl/*/' and key: gradle-groovy-dsl-v1-910dbffcc305745a058a12e2e70374d3: Error: Failed to CreateCacheEntry: Received non-retryable error: Failed request: (409) Conflict: cache entry with the same key, version, and scope already exists
android-ubuntu-e2e-test-ci (x86, 28, default) / Android Ubuntu e2e test (change_custom_server)
Failed to save cache entry with path '/home/runner/.gradle/wrapper/dists/gradle-8.8-all/6gdy1pgp427xkqcjbxw3ylt6h' and key: gradle-wrapper-zips-v1-3600859674b461a36bd4c8379d91f6cb: Error: Failed to CreateCacheEntry: Received non-retryable error: Failed request: (409) Conflict: cache entry with the same key, version, and scope already exists
android-ubuntu-e2e-test-ci (x86, 28, default) / Android Ubuntu e2e test (change_custom_server)
Failed to save cache entry with path '/home/runner/.gradle/caches/modules-*/files-*/*/*/*/*' and key: gradle-dependencies-v1-04a3bf68ca15d37e2f817e3b20e56a5d: Error: Failed to CreateCacheEntry: Received non-retryable error: Failed request: (409) Conflict: cache entry with the same key, version, and scope already exists
android-ubuntu-e2e-test-ci (x86, 28, default) / Android Ubuntu e2e test (change_custom_server)
No files were found with the provided path: android/app/build/outputs/e2e_test_reports. No artifacts will be uploaded.
android-ubuntu-e2e-test-ci (x86, 28, default) / Android Ubuntu e2e test (change_custom_server)
Cache not found for keys: v0-rust-android-ubuntu-e2e-test-ci-Linux-6be15664-5abf5f57, v0-rust-android-ubuntu-e2e-test-ci-Linux-6be15664
android-ubuntu-e2e-test-ci (x86_64, 30, default) / Android Ubuntu e2e test (screen_awake)
Cache not found for keys: v0-rust-android-ubuntu-e2e-test-ci-Linux-6be15664-da39a3ee, v0-rust-android-ubuntu-e2e-test-ci-Linux-6be15664
android-ubuntu-e2e-test-ci (x86_64, 30, default) / Android Ubuntu e2e test (screen_awake)
Failed to save cache entry with path '/home/runner/.gradle/caches/8.8/generated-gradle-jars/gradle-api-8.8.jar' and key: gradle-generated-gradle-jars-v1-8b02b97fb417a75a34543e345c4e56f3: Error: Failed to CreateCacheEntry: Received non-retryable error: Failed request: (409) Conflict: cache entry with the same key, version, and scope already exists
android-ubuntu-e2e-test-ci (x86_64, 30, default) / Android Ubuntu e2e test (screen_awake)
Failed to save cache entry with path '/home/runner/.gradle/caches/jars-*/*/' and key: gradle-instrumented-jars-v1-4a30506eb0d948e967d0892fa5c45110: Error: Failed to CreateCacheEntry: Received non-retryable error: Failed request: (409) Conflict: cache entry with the same key, version, and scope already exists
android-ubuntu-e2e-test-ci (x86_64, 30, default) / Android Ubuntu e2e test (screen_awake)
Failed to save cache entry with path '/home/runner/.gradle/caches/*/kotlin-dsl/accessors/*/,/home/runner/.gradle/caches/*/kotlin-dsl/scripts/*/' and key: gradle-kotlin-dsl-v1-9140bde3d9d7a5883115b76f0a435441: Error: Failed to CreateCacheEntry: Received non-retryable error: Failed request: (409) Conflict: cache entry with the same key, version, and scope already exists
android-ubuntu-e2e-test-ci (x86_64, 30, default) / Android Ubuntu e2e test (screen_awake)
Failed to save cache entry with path '/home/runner/.gradle/caches/*/groovy-dsl/*/' and key: gradle-groovy-dsl-v1-910dbffcc305745a058a12e2e70374d3: Error: Failed to CreateCacheEntry: Received non-retryable error: Failed request: (409) Conflict: cache entry with the same key, version, and scope already exists
android-ubuntu-e2e-test-ci (x86_64, 30, default) / Android Ubuntu e2e test (screen_awake)
Failed to save cache entry with path '/home/runner/.gradle/wrapper/dists/gradle-8.8-all/6gdy1pgp427xkqcjbxw3ylt6h' and key: gradle-wrapper-zips-v1-3600859674b461a36bd4c8379d91f6cb: Error: Failed to CreateCacheEntry: Received non-retryable error: Failed request: (409) Conflict: cache entry with the same key, version, and scope already exists
android-ubuntu-e2e-test-ci (x86_64, 30, default) / Android Ubuntu e2e test (screen_awake)
Failed to save cache entry with path '/home/runner/.gradle/caches/modules-*/files-*/*/*/*/*' and key: gradle-dependencies-v1-04a3bf68ca15d37e2f817e3b20e56a5d: Error: Failed to CreateCacheEntry: Received non-retryable error: Failed request: (409) Conflict: cache entry with the same key, version, and scope already exists
android-ubuntu-e2e-test-ci (x86_64, 30, default) / Android Ubuntu e2e test (screen_awake)
Failed to save cache entry with path '/home/runner/.gradle/caches,/home/runner/.gradle/notifications,/home/runner/.gradle/.setup-gradle' and key: gradle-home-v1|Linux-X64|android-ubuntu-e2e-test-ci[50816f954f1539f73c5ec483aa9e3ae2]-38fa32f09c2ed2042771b3ff957deed0fbe48eb2: Error: Failed to CreateCacheEntry: Received non-retryable error: Failed request: (409) Conflict: cache entry with the same key, version, and scope already exists
android-ubuntu-e2e-test-ci (x86_64, 30, default) / Android Ubuntu e2e test (screen_awake)
No files were found with the provided path: android/app/build/outputs/e2e_test_reports. No artifacts will be uploaded.
android-ubuntu-e2e-test-ci (x86_64, 30, default) / Android Ubuntu e2e test (screen_awake)
Cache not found for keys: v0-rust-android-ubuntu-e2e-test-ci-Linux-6be15664-5abf5f57, v0-rust-android-ubuntu-e2e-test-ci-Linux-6be15664
android-ubuntu-e2e-test-ci (x86, 28, default) / Android Ubuntu e2e test (change_custom_testnet_server)
Cache not found for keys: v0-rust-android-ubuntu-e2e-test-ci-Linux-6be15664-da39a3ee, v0-rust-android-ubuntu-e2e-test-ci-Linux-6be15664
android-ubuntu-e2e-test-ci (x86, 28, default) / Android Ubuntu e2e test (change_custom_testnet_server)
No files were found with the provided path: android/app/build/outputs/e2e_test_reports. No artifacts will be uploaded.
android-ubuntu-e2e-test-ci (x86, 28, default) / Android Ubuntu e2e test (change_custom_testnet_server)
Cache not found for keys: v0-rust-android-ubuntu-e2e-test-ci-Linux-6be15664-5abf5f57, v0-rust-android-ubuntu-e2e-test-ci-Linux-6be15664
android-ubuntu-e2e-test-ci (x86, 28, default) / Android Ubuntu e2e test (change_custom_testnet_server)
Failed to save cache entry with path '/home/runner/.gradle/caches/8.8/generated-gradle-jars/gradle-api-8.8.jar' and key: gradle-generated-gradle-jars-v1-8b02b97fb417a75a34543e345c4e56f3: Error: Failed to CreateCacheEntry: Received non-retryable error: Failed request: (409) Conflict: cache entry with the same key, version, and scope already exists
android-ubuntu-e2e-test-ci (x86, 28, default) / Android Ubuntu e2e test (change_custom_testnet_server)
Failed to save cache entry with path '/home/runner/.gradle/caches/jars-*/*/' and key: gradle-instrumented-jars-v1-4a30506eb0d948e967d0892fa5c45110: Error: Failed to CreateCacheEntry: Received non-retryable error: Failed request: (409) Conflict: cache entry with the same key, version, and scope already exists
android-ubuntu-e2e-test-ci (x86, 28, default) / Android Ubuntu e2e test (change_custom_testnet_server)
Failed to save cache entry with path '/home/runner/.gradle/caches/*/kotlin-dsl/accessors/*/,/home/runner/.gradle/caches/*/kotlin-dsl/scripts/*/' and key: gradle-kotlin-dsl-v1-9140bde3d9d7a5883115b76f0a435441: Error: Failed to CreateCacheEntry: Received non-retryable error: Failed request: (409) Conflict: cache entry with the same key, version, and scope already exists
android-ubuntu-e2e-test-ci (x86, 28, default) / Android Ubuntu e2e test (change_custom_testnet_server)
Failed to save cache entry with path '/home/runner/.gradle/caches/*/groovy-dsl/*/' and key: gradle-groovy-dsl-v1-910dbffcc305745a058a12e2e70374d3: Error: Failed to CreateCacheEntry: Received non-retryable error: Failed request: (409) Conflict: cache entry with the same key, version, and scope already exists
android-ubuntu-e2e-test-ci (x86, 28, default) / Android Ubuntu e2e test (change_custom_testnet_server)
Failed to save cache entry with path '/home/runner/.gradle/wrapper/dists/gradle-8.8-all/6gdy1pgp427xkqcjbxw3ylt6h' and key: gradle-wrapper-zips-v1-3600859674b461a36bd4c8379d91f6cb: Error: Failed to CreateCacheEntry: Received non-retryable error: Failed request: (409) Conflict: cache entry with the same key, version, and scope already exists
android-ubuntu-e2e-test-ci (x86, 28, default) / Android Ubuntu e2e test (change_custom_testnet_server)
Failed to save cache entry with path '/home/runner/.gradle/caches/modules-*/files-*/*/*/*/*' and key: gradle-dependencies-v1-04a3bf68ca15d37e2f817e3b20e56a5d: Error: Failed to CreateCacheEntry: Received non-retryable error: Failed request: (409) Conflict: cache entry with the same key, version, and scope already exists
android-ubuntu-e2e-test-ci (x86_64, 30, default) / Android Ubuntu e2e test (send)
Cache not found for keys: v0-rust-android-ubuntu-e2e-test-ci-Linux-6be15664-da39a3ee, v0-rust-android-ubuntu-e2e-test-ci-Linux-6be15664
android-ubuntu-e2e-test-ci (x86_64, 30, default) / Android Ubuntu e2e test (send)
Cache not found for keys: v0-rust-android-ubuntu-e2e-test-ci-Linux-6be15664-5abf5f57, v0-rust-android-ubuntu-e2e-test-ci-Linux-6be15664
android-ubuntu-e2e-test-ci (x86_64, 30, default) / Android Ubuntu e2e test (send)
Failed to save cache entry with path '/home/runner/.gradle/caches/8.8/generated-gradle-jars/gradle-api-8.8.jar' and key: gradle-generated-gradle-jars-v1-8b02b97fb417a75a34543e345c4e56f3: Error: Failed to CreateCacheEntry: Received non-retryable error: Failed request: (409) Conflict: cache entry with the same key, version, and scope already exists
android-ubuntu-e2e-test-ci (x86_64, 30, default) / Android Ubuntu e2e test (send)
Failed to save cache entry with path '/home/runner/.gradle/caches/jars-*/*/' and key: gradle-instrumented-jars-v1-4a30506eb0d948e967d0892fa5c45110: Error: Failed to CreateCacheEntry: Received non-retryable error: Failed request: (409) Conflict: cache entry with the same key, version, and scope already exists
android-ubuntu-e2e-test-ci (x86_64, 30, default) / Android Ubuntu e2e test (send)
Failed to save cache entry with path '/home/runner/.gradle/caches/*/kotlin-dsl/accessors/*/,/home/runner/.gradle/caches/*/kotlin-dsl/scripts/*/' and key: gradle-kotlin-dsl-v1-9140bde3d9d7a5883115b76f0a435441: Error: Failed to CreateCacheEntry: Received non-retryable error: Failed request: (409) Conflict: cache entry with the same key, version, and scope already exists
android-ubuntu-e2e-test-ci (x86_64, 30, default) / Android Ubuntu e2e test (send)
Failed to save cache entry with path '/home/runner/.gradle/caches/*/groovy-dsl/*/' and key: gradle-groovy-dsl-v1-910dbffcc305745a058a12e2e70374d3: Error: Failed to CreateCacheEntry: Received non-retryable error: Failed request: (409) Conflict: cache entry with the same key, version, and scope already exists
android-ubuntu-e2e-test-ci (x86_64, 30, default) / Android Ubuntu e2e test (send)
Failed to save cache entry with path '/home/runner/.gradle/caches/modules-*/files-*/*/*/*/*' and key: gradle-dependencies-v1-04a3bf68ca15d37e2f817e3b20e56a5d: Error: Failed to CreateCacheEntry: Received non-retryable error: Failed request: (409) Conflict: cache entry with the same key, version, and scope already exists
android-ubuntu-e2e-test-ci (x86_64, 30, default) / Android Ubuntu e2e test (send)
Failed to save cache entry with path '/home/runner/.gradle/wrapper/dists/gradle-8.8-all/6gdy1pgp427xkqcjbxw3ylt6h' and key: gradle-wrapper-zips-v1-3600859674b461a36bd4c8379d91f6cb: Error: Failed to CreateCacheEntry: Received non-retryable error: Failed request: (409) Conflict: cache entry with the same key, version, and scope already exists
android-ubuntu-e2e-test-ci (x86_64, 30, default) / Android Ubuntu e2e test (send)
No files were found with the provided path: android/app/build/outputs/e2e_test_reports. No artifacts will be uploaded.
android-ubuntu-e2e-test-ci (x86, 28, default) / Android Ubuntu e2e test (transaction_history)
Cache not found for keys: v0-rust-android-ubuntu-e2e-test-ci-Linux-6be15664-da39a3ee, v0-rust-android-ubuntu-e2e-test-ci-Linux-6be15664
android-ubuntu-e2e-test-ci (x86, 28, default) / Android Ubuntu e2e test (transaction_history)
Cache not found for keys: v0-rust-android-ubuntu-e2e-test-ci-Linux-6be15664-5abf5f57, v0-rust-android-ubuntu-e2e-test-ci-Linux-6be15664
android-ubuntu-e2e-test-ci (x86, 28, default) / Android Ubuntu e2e test (transaction_history)
Failed to save cache entry with path '/home/runner/.gradle/caches/8.8/generated-gradle-jars/gradle-api-8.8.jar' and key: gradle-generated-gradle-jars-v1-8b02b97fb417a75a34543e345c4e56f3: Error: Failed to CreateCacheEntry: Received non-retryable error: Failed request: (409) Conflict: cache entry with the same key, version, and scope already exists
android-ubuntu-e2e-test-ci (x86, 28, default) / Android Ubuntu e2e test (transaction_history)
Failed to save cache entry with path '/home/runner/.gradle/caches/jars-*/*/' and key: gradle-instrumented-jars-v1-4a30506eb0d948e967d0892fa5c45110: Error: Failed to CreateCacheEntry: Received non-retryable error: Failed request: (409) Conflict: cache entry with the same key, version, and scope already exists
android-ubuntu-e2e-test-ci (x86, 28, default) / Android Ubuntu e2e test (transaction_history)
Failed to save cache entry with path '/home/runner/.gradle/caches/*/kotlin-dsl/accessors/*/,/home/runner/.gradle/caches/*/kotlin-dsl/scripts/*/' and key: gradle-kotlin-dsl-v1-9140bde3d9d7a5883115b76f0a435441: Error: Failed to CreateCacheEntry: Received non-retryable error: Failed request: (409) Conflict: cache entry with the same key, version, and scope already exists
android-ubuntu-e2e-test-ci (x86, 28, default) / Android Ubuntu e2e test (transaction_history)
Failed to save cache entry with path '/home/runner/.gradle/caches/*/groovy-dsl/*/' and key: gradle-groovy-dsl-v1-910dbffcc305745a058a12e2e70374d3: Error: Failed to CreateCacheEntry: Received non-retryable error: Failed request: (409) Conflict: cache entry with the same key, version, and scope already exists
android-ubuntu-e2e-test-ci (x86, 28, default) / Android Ubuntu e2e test (transaction_history)
Failed to save cache entry with path '/home/runner/.gradle/wrapper/dists/gradle-8.8-all/6gdy1pgp427xkqcjbxw3ylt6h' and key: gradle-wrapper-zips-v1-3600859674b461a36bd4c8379d91f6cb: Error: Failed to CreateCacheEntry: Received non-retryable error: Failed request: (409) Conflict: cache entry with the same key, version, and scope already exists
android-ubuntu-e2e-test-ci (x86, 28, default) / Android Ubuntu e2e test (transaction_history)
Failed to save cache entry with path '/home/runner/.gradle/caches/modules-*/files-*/*/*/*/*' and key: gradle-dependencies-v1-04a3bf68ca15d37e2f817e3b20e56a5d: Error: Failed to CreateCacheEntry: Received non-retryable error: Failed request: (409) Conflict: cache entry with the same key, version, and scope already exists
android-ubuntu-e2e-test-ci (x86, 28, default) / Android Ubuntu e2e test (transaction_history)
No files were found with the provided path: android/app/build/outputs/e2e_test_reports. No artifacts will be uploaded.
android-ubuntu-e2e-test-ci (x86, 28, default) / Android Ubuntu e2e test (parse_invalid_address)
Cache not found for keys: v0-rust-android-ubuntu-e2e-test-ci-Linux-6be15664-da39a3ee, v0-rust-android-ubuntu-e2e-test-ci-Linux-6be15664
android-ubuntu-e2e-test-ci (x86, 28, default) / Android Ubuntu e2e test (parse_invalid_address)
No files were found with the provided path: android/app/build/outputs/e2e_test_reports. No artifacts will be uploaded.
android-ubuntu-e2e-test-ci (x86, 28, default) / Android Ubuntu e2e test (parse_invalid_address)
Cache not found for keys: v0-rust-android-ubuntu-e2e-test-ci-Linux-6be15664-5abf5f57, v0-rust-android-ubuntu-e2e-test-ci-Linux-6be15664
android-ubuntu-e2e-test-ci (x86, 28, default) / Android Ubuntu e2e test (parse_invalid_address)
Failed to save cache entry with path '/home/runner/.gradle/caches/8.8/generated-gradle-jars/gradle-api-8.8.jar' and key: gradle-generated-gradle-jars-v1-8b02b97fb417a75a34543e345c4e56f3: Error: Failed to CreateCacheEntry: Received non-retryable error: Failed request: (409) Conflict: cache entry with the same key, version, and scope already exists
android-ubuntu-e2e-test-ci (x86, 28, default) / Android Ubuntu e2e test (parse_invalid_address)
Failed to save cache entry with path '/home/runner/.gradle/caches/jars-*/*/' and key: gradle-instrumented-jars-v1-4a30506eb0d948e967d0892fa5c45110: Error: Failed to CreateCacheEntry: Received non-retryable error: Failed request: (409) Conflict: cache entry with the same key, version, and scope already exists
android-ubuntu-e2e-test-ci (x86, 28, default) / Android Ubuntu e2e test (parse_invalid_address)
Failed to save cache entry with path '/home/runner/.gradle/caches/*/kotlin-dsl/accessors/*/,/home/runner/.gradle/caches/*/kotlin-dsl/scripts/*/' and key: gradle-kotlin-dsl-v1-9140bde3d9d7a5883115b76f0a435441: Error: Failed to CreateCacheEntry: Received non-retryable error: Failed request: (409) Conflict: cache entry with the same key, version, and scope already exists
android-ubuntu-e2e-test-ci (x86, 28, default) / Android Ubuntu e2e test (parse_invalid_address)
Failed to save cache entry with path '/home/runner/.gradle/caches/*/groovy-dsl/*/' and key: gradle-groovy-dsl-v1-910dbffcc305745a058a12e2e70374d3: Error: Failed to CreateCacheEntry: Received non-retryable error: Failed request: (409) Conflict: cache entry with the same key, version, and scope already exists
android-ubuntu-e2e-test-ci (x86, 28, default) / Android Ubuntu e2e test (parse_invalid_address)
Failed to save cache entry with path '/home/runner/.gradle/wrapper/dists/gradle-8.8-all/6gdy1pgp427xkqcjbxw3ylt6h' and key: gradle-wrapper-zips-v1-3600859674b461a36bd4c8379d91f6cb: Error: Failed to CreateCacheEntry: Received non-retryable error: Failed request: (409) Conflict: cache entry with the same key, version, and scope already exists
android-ubuntu-e2e-test-ci (x86, 28, default) / Android Ubuntu e2e test (parse_invalid_address)
Failed to save cache entry with path '/home/runner/.gradle/caches/modules-*/files-*/*/*/*/*' and key: gradle-dependencies-v1-04a3bf68ca15d37e2f817e3b20e56a5d: Error: Failed to CreateCacheEntry: Received non-retryable error: Failed request: (409) Conflict: cache entry with the same key, version, and scope already exists
android-ubuntu-e2e-test-ci (x86_64, 30, default) / Android Ubuntu e2e test (shielding)
Cache not found for keys: v0-rust-android-ubuntu-e2e-test-ci-Linux-6be15664-da39a3ee, v0-rust-android-ubuntu-e2e-test-ci-Linux-6be15664
android-ubuntu-e2e-test-ci (x86_64, 30, default) / Android Ubuntu e2e test (shielding)
Failed to save cache entry with path '/home/runner/.gradle/caches/8.8/generated-gradle-jars/gradle-api-8.8.jar' and key: gradle-generated-gradle-jars-v1-8b02b97fb417a75a34543e345c4e56f3: Error: Failed to CreateCacheEntry: Received non-retryable error: Failed request: (409) Conflict: cache entry with the same key, version, and scope already exists
android-ubuntu-e2e-test-ci (x86_64, 30, default) / Android Ubuntu e2e test (shielding)
Failed to save cache entry with path '/home/runner/.gradle/caches/jars-*/*/' and key: gradle-instrumented-jars-v1-4a30506eb0d948e967d0892fa5c45110: Error: Failed to CreateCacheEntry: Received non-retryable error: Failed request: (409) Conflict: cache entry with the same key, version, and scope already exists
android-ubuntu-e2e-test-ci (x86_64, 30, default) / Android Ubuntu e2e test (shielding)
Failed to save cache entry with path '/home/runner/.gradle/caches/*/kotlin-dsl/accessors/*/,/home/runner/.gradle/caches/*/kotlin-dsl/scripts/*/' and key: gradle-kotlin-dsl-v1-9140bde3d9d7a5883115b76f0a435441: Error: Failed to CreateCacheEntry: Received non-retryable error: Failed request: (409) Conflict: cache entry with the same key, version, and scope already exists
android-ubuntu-e2e-test-ci (x86_64, 30, default) / Android Ubuntu e2e test (shielding)
Failed to save cache entry with path '/home/runner/.gradle/caches/*/groovy-dsl/*/' and key: gradle-groovy-dsl-v1-910dbffcc305745a058a12e2e70374d3: Error: Failed to CreateCacheEntry: Received non-retryable error: Failed request: (409) Conflict: cache entry with the same key, version, and scope already exists
android-ubuntu-e2e-test-ci (x86_64, 30, default) / Android Ubuntu e2e test (shielding)
Failed to save cache entry with path '/home/runner/.gradle/wrapper/dists/gradle-8.8-all/6gdy1pgp427xkqcjbxw3ylt6h' and key: gradle-wrapper-zips-v1-3600859674b461a36bd4c8379d91f6cb: Error: Failed to CreateCacheEntry: Received non-retryable error: Failed request: (409) Conflict: cache entry with the same key, version, and scope already exists
android-ubuntu-e2e-test-ci (x86_64, 30, default) / Android Ubuntu e2e test (shielding)
Failed to save cache entry with path '/home/runner/.gradle/caches/modules-*/files-*/*/*/*/*' and key: gradle-dependencies-v1-04a3bf68ca15d37e2f817e3b20e56a5d: Error: Failed to CreateCacheEntry: Received non-retryable error: Failed request: (409) Conflict: cache entry with the same key, version, and scope already exists
android-ubuntu-e2e-test-ci (x86_64, 30, default) / Android Ubuntu e2e test (shielding)
No files were found with the provided path: android/app/build/outputs/e2e_test_reports. No artifacts will be uploaded.
android-ubuntu-e2e-test-ci (x86_64, 30, default) / Android Ubuntu e2e test (shielding)
Cache not found for keys: v0-rust-android-ubuntu-e2e-test-ci-Linux-6be15664-5abf5f57, v0-rust-android-ubuntu-e2e-test-ci-Linux-6be15664
android-ubuntu-e2e-test-ci (x86, 28, default) / Android Ubuntu e2e test (change_server_from_list)
Cache not found for keys: v0-rust-android-ubuntu-e2e-test-ci-Linux-6be15664-da39a3ee, v0-rust-android-ubuntu-e2e-test-ci-Linux-6be15664
android-ubuntu-e2e-test-ci (x86, 28, default) / Android Ubuntu e2e test (change_server_from_list)
No files were found with the provided path: android/app/build/outputs/e2e_test_reports. No artifacts will be uploaded.
android-ubuntu-e2e-test-ci (x86, 28, default) / Android Ubuntu e2e test (change_server_from_list)
Failed to save cache entry with path '/home/runner/.gradle/caches/8.8/generated-gradle-jars/gradle-api-8.8.jar' and key: gradle-generated-gradle-jars-v1-8b02b97fb417a75a34543e345c4e56f3: Error: Failed to CreateCacheEntry: Received non-retryable error: Failed request: (409) Conflict: cache entry with the same key, version, and scope already exists
android-ubuntu-e2e-test-ci (x86, 28, default) / Android Ubuntu e2e test (change_server_from_list)
Failed to save cache entry with path '/home/runner/.gradle/caches/jars-*/*/' and key: gradle-instrumented-jars-v1-4a30506eb0d948e967d0892fa5c45110: Error: Failed to CreateCacheEntry: Received non-retryable error: Failed request: (409) Conflict: cache entry with the same key, version, and scope already exists
android-ubuntu-e2e-test-ci (x86, 28, default) / Android Ubuntu e2e test (change_server_from_list)
Failed to save cache entry with path '/home/runner/.gradle/caches/*/kotlin-dsl/accessors/*/,/home/runner/.gradle/caches/*/kotlin-dsl/scripts/*/' and key: gradle-kotlin-dsl-v1-9140bde3d9d7a5883115b76f0a435441: Error: Failed to CreateCacheEntry: Received non-retryable error: Failed request: (409) Conflict: cache entry with the same key, version, and scope already exists
android-ubuntu-e2e-test-ci (x86, 28, default) / Android Ubuntu e2e test (change_server_from_list)
Failed to save cache entry with path '/home/runner/.gradle/caches/*/groovy-dsl/*/' and key: gradle-groovy-dsl-v1-910dbffcc305745a058a12e2e70374d3: Error: Failed to CreateCacheEntry: Received non-retryable error: Failed request: (409) Conflict: cache entry with the same key, version, and scope already exists
android-ubuntu-e2e-test-ci (x86, 28, default) / Android Ubuntu e2e test (change_server_from_list)
Failed to save cache entry with path '/home/runner/.gradle/wrapper/dists/gradle-8.8-all/6gdy1pgp427xkqcjbxw3ylt6h' and key: gradle-wrapper-zips-v1-3600859674b461a36bd4c8379d91f6cb: Error: Failed to CreateCacheEntry: Received non-retryable error: Failed request: (409) Conflict: cache entry with the same key, version, and scope already exists
android-ubuntu-e2e-test-ci (x86, 28, default) / Android Ubuntu e2e test (change_server_from_list)
Failed to save cache entry with path '/home/runner/.gradle/caches/modules-*/files-*/*/*/*/*' and key: gradle-dependencies-v1-04a3bf68ca15d37e2f817e3b20e56a5d: Error: Failed to CreateCacheEntry: Received non-retryable error: Failed request: (409) Conflict: cache entry with the same key, version, and scope already exists
android-ubuntu-e2e-test-ci (x86, 28, default) / Android Ubuntu e2e test (change_server_from_list)
Failed to save cache entry with path '/home/runner/.gradle/caches,/home/runner/.gradle/notifications,/home/runner/.gradle/.setup-gradle' and key: gradle-home-v1|Linux-X64|android-ubuntu-e2e-test-ci[12e3bc42e06dd1fee769bc6b3bc72742]-38fa32f09c2ed2042771b3ff957deed0fbe48eb2: Error: Failed to CreateCacheEntry: Received non-retryable error: Failed request: (409) Conflict: cache entry with the same key, version, and scope already exists
android-ubuntu-e2e-test-ci (x86, 28, default) / Android Ubuntu e2e test (change_server_from_list)
Cache not found for keys: v0-rust-android-ubuntu-e2e-test-ci-Linux-6be15664-5abf5f57, v0-rust-android-ubuntu-e2e-test-ci-Linux-6be15664
android-ubuntu-e2e-test-ci (x86_64, 30, default) / Android Ubuntu e2e test (parse_invalid_address)
Cache not found for keys: v0-rust-android-ubuntu-e2e-test-ci-Linux-6be15664-da39a3ee, v0-rust-android-ubuntu-e2e-test-ci-Linux-6be15664
android-ubuntu-e2e-test-ci (x86_64, 30, default) / Android Ubuntu e2e test (parse_invalid_address)
Cache not found for keys: v0-rust-android-ubuntu-e2e-test-ci-Linux-6be15664-5abf5f57, v0-rust-android-ubuntu-e2e-test-ci-Linux-6be15664
android-ubuntu-e2e-test-ci (x86_64, 30, default) / Android Ubuntu e2e test (parse_invalid_address)
Failed to save cache entry with path '/home/runner/.gradle/caches/8.8/generated-gradle-jars/gradle-api-8.8.jar' and key: gradle-generated-gradle-jars-v1-8b02b97fb417a75a34543e345c4e56f3: Error: Failed to CreateCacheEntry: Received non-retryable error: Failed request: (409) Conflict: cache entry with the same key, version, and scope already exists
android-ubuntu-e2e-test-ci (x86_64, 30, default) / Android Ubuntu e2e test (parse_invalid_address)
Failed to save cache entry with path '/home/runner/.gradle/caches/jars-*/*/' and key: gradle-instrumented-jars-v1-4a30506eb0d948e967d0892fa5c45110: Error: Failed to CreateCacheEntry: Received non-retryable error: Failed request: (409) Conflict: cache entry with the same key, version, and scope already exists
android-ubuntu-e2e-test-ci (x86_64, 30, default) / Android Ubuntu e2e test (parse_invalid_address)
Failed to save cache entry with path '/home/runner/.gradle/caches/*/kotlin-dsl/accessors/*/,/home/runner/.gradle/caches/*/kotlin-dsl/scripts/*/' and key: gradle-kotlin-dsl-v1-9140bde3d9d7a5883115b76f0a435441: Error: Failed to CreateCacheEntry: Received non-retryable error: Failed request: (409) Conflict: cache entry with the same key, version, and scope already exists
android-ubuntu-e2e-test-ci (x86_64, 30, default) / Android Ubuntu e2e test (parse_invalid_address)
Failed to save cache entry with path '/home/runner/.gradle/caches/*/groovy-dsl/*/' and key: gradle-groovy-dsl-v1-910dbffcc305745a058a12e2e70374d3: Error: Failed to CreateCacheEntry: Received non-retryable error: Failed request: (409) Conflict: cache entry with the same key, version, and scope already exists
android-ubuntu-e2e-test-ci (x86_64, 30, default) / Android Ubuntu e2e test (parse_invalid_address)
Failed to save cache entry with path '/home/runner/.gradle/wrapper/dists/gradle-8.8-all/6gdy1pgp427xkqcjbxw3ylt6h' and key: gradle-wrapper-zips-v1-3600859674b461a36bd4c8379d91f6cb: Error: Failed to CreateCacheEntry: Received non-retryable error: Failed request: (409) Conflict: cache entry with the same key, version, and scope already exists
android-ubuntu-e2e-test-ci (x86_64, 30, default) / Android Ubuntu e2e test (parse_invalid_address)
Failed to save cache entry with path '/home/runner/.gradle/caches/modules-*/files-*/*/*/*/*' and key: gradle-dependencies-v1-04a3bf68ca15d37e2f817e3b20e56a5d: Error: Failed to CreateCacheEntry: Received non-retryable error: Failed request: (409) Conflict: cache entry with the same key, version, and scope already exists
android-ubuntu-e2e-test-ci (x86_64, 30, default) / Android Ubuntu e2e test (parse_invalid_address)
Failed to save cache entry with path '/home/runner/.gradle/caches,/home/runner/.gradle/notifications,/home/runner/.gradle/.setup-gradle' and key: gradle-home-v1|Linux-X64|android-ubuntu-e2e-test-ci[4bc786a16e0718c3f2475b2c3517f68a]-38fa32f09c2ed2042771b3ff957deed0fbe48eb2: Error: Failed to CreateCacheEntry: Received non-retryable error: Failed request: (409) Conflict: cache entry with the same key, version, and scope already exists
android-ubuntu-e2e-test-ci (x86_64, 30, default) / Android Ubuntu e2e test (parse_invalid_address)
No files were found with the provided path: android/app/build/outputs/e2e_test_reports. No artifacts will be uploaded.
android-ubuntu-e2e-test-ci (x86_64, 30, default) / Android Ubuntu e2e test (reload_while_tx_pending)
Cache not found for keys: v0-rust-android-ubuntu-e2e-test-ci-Linux-6be15664-da39a3ee, v0-rust-android-ubuntu-e2e-test-ci-Linux-6be15664
android-ubuntu-e2e-test-ci (x86_64, 30, default) / Android Ubuntu e2e test (reload_while_tx_pending)
Failed to save cache entry with path '/home/runner/.gradle/caches/8.8/generated-gradle-jars/gradle-api-8.8.jar' and key: gradle-generated-gradle-jars-v1-8b02b97fb417a75a34543e345c4e56f3: Error: Failed to CreateCacheEntry: Received non-retryable error: Failed request: (409) Conflict: cache entry with the same key, version, and scope already exists
android-ubuntu-e2e-test-ci (x86_64, 30, default) / Android Ubuntu e2e test (reload_while_tx_pending)
Failed to save cache entry with path '/home/runner/.gradle/caches/jars-*/*/' and key: gradle-instrumented-jars-v1-4a30506eb0d948e967d0892fa5c45110: Error: Failed to CreateCacheEntry: Received non-retryable error: Failed request: (409) Conflict: cache entry with the same key, version, and scope already exists
android-ubuntu-e2e-test-ci (x86_64, 30, default) / Android Ubuntu e2e test (reload_while_tx_pending)
Failed to save cache entry with path '/home/runner/.gradle/caches/*/kotlin-dsl/accessors/*/,/home/runner/.gradle/caches/*/kotlin-dsl/scripts/*/' and key: gradle-kotlin-dsl-v1-9140bde3d9d7a5883115b76f0a435441: Error: Failed to CreateCacheEntry: Received non-retryable error: Failed request: (409) Conflict: cache entry with the same key, version, and scope already exists
android-ubuntu-e2e-test-ci (x86_64, 30, default) / Android Ubuntu e2e test (reload_while_tx_pending)
Failed to save cache entry with path '/home/runner/.gradle/caches/*/groovy-dsl/*/' and key: gradle-groovy-dsl-v1-910dbffcc305745a058a12e2e70374d3: Error: Failed to CreateCacheEntry: Received non-retryable error: Failed request: (409) Conflict: cache entry with the same key, version, and scope already exists
android-ubuntu-e2e-test-ci (x86_64, 30, default) / Android Ubuntu e2e test (reload_while_tx_pending)
Failed to save cache entry with path '/home/runner/.gradle/wrapper/dists/gradle-8.8-all/6gdy1pgp427xkqcjbxw3ylt6h' and key: gradle-wrapper-zips-v1-3600859674b461a36bd4c8379d91f6cb: Error: Failed to CreateCacheEntry: Received non-retryable error: Failed request: (409) Conflict: cache entry with the same key, version, and scope already exists
android-ubuntu-e2e-test-ci (x86_64, 30, default) / Android Ubuntu e2e test (reload_while_tx_pending)
Failed to save cache entry with path '/home/runner/.gradle/caches/modules-*/files-*/*/*/*/*' and key: gradle-dependencies-v1-04a3bf68ca15d37e2f817e3b20e56a5d: Error: Failed to CreateCacheEntry: Received non-retryable error: Failed request: (409) Conflict: cache entry with the same key, version, and scope already exists
android-ubuntu-e2e-test-ci (x86_64, 30, default) / Android Ubuntu e2e test (reload_while_tx_pending)
No files were found with the provided path: android/app/build/outputs/e2e_test_reports. No artifacts will be uploaded.
android-ubuntu-e2e-test-ci (x86_64, 30, default) / Android Ubuntu e2e test (reload_while_tx_pending)
Cache not found for keys: v0-rust-android-ubuntu-e2e-test-ci-Linux-6be15664-5abf5f57, v0-rust-android-ubuntu-e2e-test-ci-Linux-6be15664
android-ubuntu-integration-test-ci (x86_64, 34, default) / Android Ubuntu Integration test (execute_parse_addresses)
No files were found with the provided path: android/app/build/outputs/integration_test_reports. No artifacts will be uploaded.
android-ubuntu-integration-test-ci (x86_64, 34, default) / Android Ubuntu Integration test (execute_parse_addresses)
Failed to save cache entry with path '/home/runner/.gradle/caches/8.8/generated-gradle-jars/gradle-api-8.8.jar' and key: gradle-generated-gradle-jars-v1-8b02b97fb417a75a34543e345c4e56f3: Error: Failed to CreateCacheEntry: Received non-retryable error: Failed request: (409) Conflict: cache entry with the same key, version, and scope already exists
android-ubuntu-integration-test-ci (x86_64, 34, default) / Android Ubuntu Integration test (execute_parse_addresses)
Failed to save cache entry with path '/home/runner/.gradle/caches/jars-*/*/' and key: gradle-instrumented-jars-v1-4a30506eb0d948e967d0892fa5c45110: Error: Failed to CreateCacheEntry: Received non-retryable error: Failed request: (409) Conflict: cache entry with the same key, version, and scope already exists
android-ubuntu-integration-test-ci (x86_64, 34, default) / Android Ubuntu Integration test (execute_parse_addresses)
Failed to save cache entry with path '/home/runner/.gradle/caches/*/kotlin-dsl/accessors/*/,/home/runner/.gradle/caches/*/kotlin-dsl/scripts/*/' and key: gradle-kotlin-dsl-v1-9140bde3d9d7a5883115b76f0a435441: Error: Failed to CreateCacheEntry: Received non-retryable error: Failed request: (409) Conflict: cache entry with the same key, version, and scope already exists
android-ubuntu-integration-test-ci (x86_64, 34, default) / Android Ubuntu Integration test (execute_parse_addresses)
Failed to save cache entry with path '/home/runner/.gradle/caches/*/groovy-dsl/*/' and key: gradle-groovy-dsl-v1-910dbffcc305745a058a12e2e70374d3: Error: Failed to CreateCacheEntry: Received non-retryable error: Failed request: (409) Conflict: cache entry with the same key, version, and scope already exists
android-ubuntu-integration-test-ci (x86_64, 34, default) / Android Ubuntu Integration test (execute_parse_addresses)
Failed to save cache entry with path '/home/runner/.gradle/wrapper/dists/gradle-8.8-all/6gdy1pgp427xkqcjbxw3ylt6h' and key: gradle-wrapper-zips-v1-3600859674b461a36bd4c8379d91f6cb: Error: Failed to CreateCacheEntry: Received non-retryable error: Failed request: (409) Conflict: cache entry with the same key, version, and scope already exists
android-ubuntu-integration-test-ci (x86_64, 34, default) / Android Ubuntu Integration test (execute_parse_addresses)
Failed to save cache entry with path '/home/runner/.gradle/caches/modules-*/files-*/*/*/*/*' and key: gradle-dependencies-v1-04a3bf68ca15d37e2f817e3b20e56a5d: Error: Failed to CreateCacheEntry: Received non-retryable error: Failed request: (409) Conflict: cache entry with the same key, version, and scope already exists
android-ubuntu-e2e-test-ci (x86, 28, default) / Android Ubuntu e2e test (shielding)
Cache not found for keys: v0-rust-android-ubuntu-e2e-test-ci-Linux-6be15664-da39a3ee, v0-rust-android-ubuntu-e2e-test-ci-Linux-6be15664
android-ubuntu-e2e-test-ci (x86, 28, default) / Android Ubuntu e2e test (shielding)
No files were found with the provided path: android/app/build/outputs/e2e_test_reports. No artifacts will be uploaded.
android-ubuntu-e2e-test-ci (x86, 28, default) / Android Ubuntu e2e test (shielding)
Cache not found for keys: v0-rust-android-ubuntu-e2e-test-ci-Linux-6be15664-5abf5f57, v0-rust-android-ubuntu-e2e-test-ci-Linux-6be15664
android-ubuntu-e2e-test-ci (x86, 28, default) / Android Ubuntu e2e test (shielding)
Failed to save cache entry with path '/home/runner/.gradle/caches/8.8/generated-gradle-jars/gradle-api-8.8.jar' and key: gradle-generated-gradle-jars-v1-8b02b97fb417a75a34543e345c4e56f3: Error: Failed to CreateCacheEntry: Received non-retryable error: Failed request: (409) Conflict: cache entry with the same key, version, and scope already exists
android-ubuntu-e2e-test-ci (x86, 28, default) / Android Ubuntu e2e test (shielding)
Failed to save cache entry with path '/home/runner/.gradle/caches/jars-*/*/' and key: gradle-instrumented-jars-v1-4a30506eb0d948e967d0892fa5c45110: Error: Failed to CreateCacheEntry: Received non-retryable error: Failed request: (409) Conflict: cache entry with the same key, version, and scope already exists
android-ubuntu-e2e-test-ci (x86, 28, default) / Android Ubuntu e2e test (shielding)
Failed to save cache entry with path '/home/runner/.gradle/caches/*/kotlin-dsl/accessors/*/,/home/runner/.gradle/caches/*/kotlin-dsl/scripts/*/' and key: gradle-kotlin-dsl-v1-9140bde3d9d7a5883115b76f0a435441: Error: Failed to CreateCacheEntry: Received non-retryable error: Failed request: (409) Conflict: cache entry with the same key, version, and scope already exists
android-ubuntu-e2e-test-ci (x86, 28, default) / Android Ubuntu e2e test (shielding)
Failed to save cache entry with path '/home/runner/.gradle/caches/*/groovy-dsl/*/' and key: gradle-groovy-dsl-v1-910dbffcc305745a058a12e2e70374d3: Error: Failed to CreateCacheEntry: Received non-retryable error: Failed request: (409) Conflict: cache entry with the same key, version, and scope already exists
android-ubuntu-e2e-test-ci (x86, 28, default) / Android Ubuntu e2e test (shielding)
Failed to save cache entry with path '/home/runner/.gradle/wrapper/dists/gradle-8.8-all/6gdy1pgp427xkqcjbxw3ylt6h' and key: gradle-wrapper-zips-v1-3600859674b461a36bd4c8379d91f6cb: Error: Failed to CreateCacheEntry: Received non-retryable error: Failed request: (409) Conflict: cache entry with the same key, version, and scope already exists
android-ubuntu-e2e-test-ci (x86, 28, default) / Android Ubuntu e2e test (shielding)
Failed to save cache entry with path '/home/runner/.gradle/caches/modules-*/files-*/*/*/*/*' and key: gradle-dependencies-v1-04a3bf68ca15d37e2f817e3b20e56a5d: Error: Failed to CreateCacheEntry: Received non-retryable error: Failed request: (409) Conflict: cache entry with the same key, version, and scope already exists
android-ubuntu-e2e-test-ci (x86, 28, default) / Android Ubuntu e2e test (shielding)
Failed to save cache entry with path '/home/runner/.gradle/caches,/home/runner/.gradle/notifications,/home/runner/.gradle/.setup-gradle' and key: gradle-home-v1|Linux-X64|android-ubuntu-e2e-test-ci[67038fb5eee547b5c266ab19cb89d29d]-38fa32f09c2ed2042771b3ff957deed0fbe48eb2: Error: Failed to CreateCacheEntry: Received non-retryable error: Failed request: (409) Conflict: cache entry with the same key, version, and scope already exists
android-ubuntu-e2e-test-ci (x86_64, 30, default) / Android Ubuntu e2e test (transaction_history)
Cache not found for keys: v0-rust-android-ubuntu-e2e-test-ci-Linux-6be15664-da39a3ee, v0-rust-android-ubuntu-e2e-test-ci-Linux-6be15664
android-ubuntu-e2e-test-ci (x86_64, 30, default) / Android Ubuntu e2e test (transaction_history)
Cache not found for keys: v0-rust-android-ubuntu-e2e-test-ci-Linux-6be15664-5abf5f57, v0-rust-android-ubuntu-e2e-test-ci-Linux-6be15664
android-ubuntu-e2e-test-ci (x86_64, 30, default) / Android Ubuntu e2e test (transaction_history)
No files were found with the provided path: android/app/build/outputs/e2e_test_reports. No artifacts will be uploaded.
android-ubuntu-e2e-test-ci (x86_64, 30, default) / Android Ubuntu e2e test (transaction_history)
Failed to save cache entry with path '/home/runner/.gradle/caches/8.8/generated-gradle-jars/gradle-api-8.8.jar' and key: gradle-generated-gradle-jars-v1-8b02b97fb417a75a34543e345c4e56f3: Error: Failed to CreateCacheEntry: Received non-retryable error: Failed request: (409) Conflict: cache entry with the same key, version, and scope already exists
android-ubuntu-e2e-test-ci (x86_64, 30, default) / Android Ubuntu e2e test (transaction_history)
Failed to save cache entry with path '/home/runner/.gradle/caches/jars-*/*/' and key: gradle-instrumented-jars-v1-4a30506eb0d948e967d0892fa5c45110: Error: Failed to CreateCacheEntry: Received non-retryable error: Failed request: (409) Conflict: cache entry with the same key, version, and scope already exists
android-ubuntu-e2e-test-ci (x86_64, 30, default) / Android Ubuntu e2e test (transaction_history)
Failed to save cache entry with path '/home/runner/.gradle/caches/*/kotlin-dsl/accessors/*/,/home/runner/.gradle/caches/*/kotlin-dsl/scripts/*/' and key: gradle-kotlin-dsl-v1-9140bde3d9d7a5883115b76f0a435441: Error: Failed to CreateCacheEntry: Received non-retryable error: Failed request: (409) Conflict: cache entry with the same key, version, and scope already exists
android-ubuntu-e2e-test-ci (x86_64, 30, default) / Android Ubuntu e2e test (transaction_history)
Failed to save cache entry with path '/home/runner/.gradle/caches/*/groovy-dsl/*/' and key: gradle-groovy-dsl-v1-910dbffcc305745a058a12e2e70374d3: Error: Failed to CreateCacheEntry: Received non-retryable error: Failed request: (409) Conflict: cache entry with the same key, version, and scope already exists
android-ubuntu-e2e-test-ci (x86_64, 30, default) / Android Ubuntu e2e test (transaction_history)
Failed to save cache entry with path '/home/runner/.gradle/wrapper/dists/gradle-8.8-all/6gdy1pgp427xkqcjbxw3ylt6h' and key: gradle-wrapper-zips-v1-3600859674b461a36bd4c8379d91f6cb: Error: Failed to CreateCacheEntry: Received non-retryable error: Failed request: (409) Conflict: cache entry with the same key, version, and scope already exists
android-ubuntu-e2e-test-ci (x86_64, 30, default) / Android Ubuntu e2e test (transaction_history)
Failed to save cache entry with path '/home/runner/.gradle/caches/modules-*/files-*/*/*/*/*' and key: gradle-dependencies-v1-04a3bf68ca15d37e2f817e3b20e56a5d: Error: Failed to CreateCacheEntry: Received non-retryable error: Failed request: (409) Conflict: cache entry with the same key, version, and scope already exists
android-ubuntu-e2e-test-ci (x86_64, 30, default) / Android Ubuntu e2e test (transaction_history)
Failed to save cache entry with path '/home/runner/.gradle/caches,/home/runner/.gradle/notifications,/home/runner/.gradle/.setup-gradle' and key: gradle-home-v1|Linux-X64|android-ubuntu-e2e-test-ci[a494ec72a89e4a84f8a6be768222ca28]-38fa32f09c2ed2042771b3ff957deed0fbe48eb2: Error: Failed to CreateCacheEntry: Received non-retryable error: Failed request: (409) Conflict: cache entry with the same key, version, and scope already exists
android-ubuntu-integration-test-ci (x86_64, 34, default) / Android Ubuntu Integration test (execute_sync_from_seed)
No files were found with the provided path: android/app/build/outputs/integration_test_reports. No artifacts will be uploaded.
android-ubuntu-integration-test-ci (x86_64, 34, default) / Android Ubuntu Integration test (execute_sync_from_seed)
Failed to save cache entry with path '/home/runner/.gradle/caches/8.8/generated-gradle-jars/gradle-api-8.8.jar' and key: gradle-generated-gradle-jars-v1-8b02b97fb417a75a34543e345c4e56f3: Error: Failed to CreateCacheEntry: Received non-retryable error: Failed request: (409) Conflict: cache entry with the same key, version, and scope already exists
android-ubuntu-integration-test-ci (x86_64, 34, default) / Android Ubuntu Integration test (execute_sync_from_seed)
Failed to save cache entry with path '/home/runner/.gradle/caches/jars-*/*/' and key: gradle-instrumented-jars-v1-4a30506eb0d948e967d0892fa5c45110: Error: Failed to CreateCacheEntry: Received non-retryable error: Failed request: (409) Conflict: cache entry with the same key, version, and scope already exists
android-ubuntu-integration-test-ci (x86_64, 34, default) / Android Ubuntu Integration test (execute_sync_from_seed)
Failed to save cache entry with path '/home/runner/.gradle/caches/*/kotlin-dsl/accessors/*/,/home/runner/.gradle/caches/*/kotlin-dsl/scripts/*/' and key: gradle-kotlin-dsl-v1-9140bde3d9d7a5883115b76f0a435441: Error: Failed to CreateCacheEntry: Received non-retryable error: Failed request: (409) Conflict: cache entry with the same key, version, and scope already exists
android-ubuntu-integration-test-ci (x86_64, 34, default) / Android Ubuntu Integration test (execute_sync_from_seed)
Failed to save cache entry with path '/home/runner/.gradle/caches/*/groovy-dsl/*/' and key: gradle-groovy-dsl-v1-910dbffcc305745a058a12e2e70374d3: Error: Failed to CreateCacheEntry: Received non-retryable error: Failed request: (409) Conflict: cache entry with the same key, version, and scope already exists
android-ubuntu-integration-test-ci (x86_64, 34, default) / Android Ubuntu Integration test (execute_sync_from_seed)
Failed to save cache entry with path '/home/runner/.gradle/wrapper/dists/gradle-8.8-all/6gdy1pgp427xkqcjbxw3ylt6h' and key: gradle-wrapper-zips-v1-3600859674b461a36bd4c8379d91f6cb: Error: Failed to CreateCacheEntry: Received non-retryable error: Failed request: (409) Conflict: cache entry with the same key, version, and scope already exists
android-ubuntu-integration-test-ci (x86_64, 34, default) / Android Ubuntu Integration test (execute_sync_from_seed)
Failed to save cache entry with path '/home/runner/.gradle/caches/modules-*/files-*/*/*/*/*' and key: gradle-dependencies-v1-04a3bf68ca15d37e2f817e3b20e56a5d: Error: Failed to CreateCacheEntry: Received non-retryable error: Failed request: (409) Conflict: cache entry with the same key, version, and scope already exists
android-ubuntu-e2e-test-ci (x86_64, 30, default) / Android Ubuntu e2e test (new_wallet)
Cache not found for keys: v0-rust-android-ubuntu-e2e-test-ci-Linux-6be15664-da39a3ee, v0-rust-android-ubuntu-e2e-test-ci-Linux-6be15664
android-ubuntu-e2e-test-ci (x86_64, 30, default) / Android Ubuntu e2e test (new_wallet)
Cache not found for keys: v0-rust-android-ubuntu-e2e-test-ci-Linux-6be15664-5abf5f57, v0-rust-android-ubuntu-e2e-test-ci-Linux-6be15664
android-ubuntu-e2e-test-ci (x86_64, 30, default) / Android Ubuntu e2e test (new_wallet)
No files were found with the provided path: android/app/build/outputs/e2e_test_reports. No artifacts will be uploaded.
android-ubuntu-e2e-test-ci (x86_64, 30, default) / Android Ubuntu e2e test (new_wallet)
Failed to save cache entry with path '/home/runner/.gradle/caches/8.8/generated-gradle-jars/gradle-api-8.8.jar' and key: gradle-generated-gradle-jars-v1-8b02b97fb417a75a34543e345c4e56f3: Error: Failed to CreateCacheEntry: Received non-retryable error: Failed request: (409) Conflict: cache entry with the same key, version, and scope already exists
android-ubuntu-e2e-test-ci (x86_64, 30, default) / Android Ubuntu e2e test (new_wallet)
Failed to save cache entry with path '/home/runner/.gradle/caches/jars-*/*/' and key: gradle-instrumented-jars-v1-4a30506eb0d948e967d0892fa5c45110: Error: Failed to CreateCacheEntry: Received non-retryable error: Failed request: (409) Conflict: cache entry with the same key, version, and scope already exists
android-ubuntu-e2e-test-ci (x86_64, 30, default) / Android Ubuntu e2e test (new_wallet)
Failed to save cache entry with path '/home/runner/.gradle/caches/*/kotlin-dsl/accessors/*/,/home/runner/.gradle/caches/*/kotlin-dsl/scripts/*/' and key: gradle-kotlin-dsl-v1-9140bde3d9d7a5883115b76f0a435441: Error: Failed to CreateCacheEntry: Received non-retryable error: Failed request: (409) Conflict: cache entry with the same key, version, and scope already exists
android-ubuntu-e2e-test-ci (x86_64, 30, default) / Android Ubuntu e2e test (new_wallet)
Failed to save cache entry with path '/home/runner/.gradle/caches/*/groovy-dsl/*/' and key: gradle-groovy-dsl-v1-910dbffcc305745a058a12e2e70374d3: Error: Failed to CreateCacheEntry: Received non-retryable error: Failed request: (409) Conflict: cache entry with the same key, version, and scope already exists
android-ubuntu-e2e-test-ci (x86_64, 30, default) / Android Ubuntu e2e test (new_wallet)
Failed to save cache entry with path '/home/runner/.gradle/caches/modules-*/files-*/*/*/*/*' and key: gradle-dependencies-v1-04a3bf68ca15d37e2f817e3b20e56a5d: Error: Failed to CreateCacheEntry: Received non-retryable error: Failed request: (409) Conflict: cache entry with the same key, version, and scope already exists
android-ubuntu-e2e-test-ci (x86_64, 30, default) / Android Ubuntu e2e test (new_wallet)
Failed to save cache entry with path '/home/runner/.gradle/wrapper/dists/gradle-8.8-all/6gdy1pgp427xkqcjbxw3ylt6h' and key: gradle-wrapper-zips-v1-3600859674b461a36bd4c8379d91f6cb: Error: Failed to CreateCacheEntry: Received non-retryable error: Failed request: (409) Conflict: cache entry with the same key, version, and scope already exists
android-ubuntu-e2e-test-ci (x86_64, 30, default) / Android Ubuntu e2e test (sync_report)
Cache not found for keys: v0-rust-android-ubuntu-e2e-test-ci-Linux-6be15664-da39a3ee, v0-rust-android-ubuntu-e2e-test-ci-Linux-6be15664
android-ubuntu-e2e-test-ci (x86_64, 30, default) / Android Ubuntu e2e test (sync_report)
Cache not found for keys: v0-rust-android-ubuntu-e2e-test-ci-Linux-6be15664-5abf5f57, v0-rust-android-ubuntu-e2e-test-ci-Linux-6be15664
android-ubuntu-e2e-test-ci (x86_64, 30, default) / Android Ubuntu e2e test (sync_report)
No files were found with the provided path: android/app/build/outputs/e2e_test_reports. No artifacts will be uploaded.
android-ubuntu-e2e-test-ci (x86_64, 30, default) / Android Ubuntu e2e test (sync_report)
Failed to save cache entry with path '/home/runner/.gradle/caches/8.8/generated-gradle-jars/gradle-api-8.8.jar' and key: gradle-generated-gradle-jars-v1-8b02b97fb417a75a34543e345c4e56f3: Error: Failed to CreateCacheEntry: Received non-retryable error: Failed request: (409) Conflict: cache entry with the same key, version, and scope already exists
android-ubuntu-e2e-test-ci (x86_64, 30, default) / Android Ubuntu e2e test (sync_report)
Failed to save cache entry with path '/home/runner/.gradle/caches/jars-*/*/' and key: gradle-instrumented-jars-v1-4a30506eb0d948e967d0892fa5c45110: Error: Failed to CreateCacheEntry: Received non-retryable error: Failed request: (409) Conflict: cache entry with the same key, version, and scope already exists
android-ubuntu-e2e-test-ci (x86_64, 30, default) / Android Ubuntu e2e test (sync_report)
Failed to save cache entry with path '/home/runner/.gradle/caches/*/kotlin-dsl/accessors/*/,/home/runner/.gradle/caches/*/kotlin-dsl/scripts/*/' and key: gradle-kotlin-dsl-v1-9140bde3d9d7a5883115b76f0a435441: Error: Failed to CreateCacheEntry: Received non-retryable error: Failed request: (409) Conflict: cache entry with the same key, version, and scope already exists
android-ubuntu-e2e-test-ci (x86_64, 30, default) / Android Ubuntu e2e test (sync_report)
Failed to save cache entry with path '/home/runner/.gradle/caches/*/groovy-dsl/*/' and key: gradle-groovy-dsl-v1-910dbffcc305745a058a12e2e70374d3: Error: Failed to CreateCacheEntry: Received non-retryable error: Failed request: (409) Conflict: cache entry with the same key, version, and scope already exists
android-ubuntu-e2e-test-ci (x86_64, 30, default) / Android Ubuntu e2e test (sync_report)
Failed to save cache entry with path '/home/runner/.gradle/wrapper/dists/gradle-8.8-all/6gdy1pgp427xkqcjbxw3ylt6h' and key: gradle-wrapper-zips-v1-3600859674b461a36bd4c8379d91f6cb: Error: Failed to CreateCacheEntry: Received non-retryable error: Failed request: (409) Conflict: cache entry with the same key, version, and scope already exists
android-ubuntu-e2e-test-ci (x86_64, 30, default) / Android Ubuntu e2e test (sync_report)
Failed to save cache entry with path '/home/runner/.gradle/caches/modules-*/files-*/*/*/*/*' and key: gradle-dependencies-v1-04a3bf68ca15d37e2f817e3b20e56a5d: Error: Failed to CreateCacheEntry: Received non-retryable error: Failed request: (409) Conflict: cache entry with the same key, version, and scope already exists
android-ubuntu-e2e-test-ci (x86, 28, default) / Android Ubuntu e2e test (reload_while_tx_pending)
Cache not found for keys: v0-rust-android-ubuntu-e2e-test-ci-Linux-6be15664-da39a3ee, v0-rust-android-ubuntu-e2e-test-ci-Linux-6be15664
android-ubuntu-e2e-test-ci (x86, 28, default) / Android Ubuntu e2e test (reload_while_tx_pending)
No files were found with the provided path: android/app/build/outputs/e2e_test_reports. No artifacts will be uploaded.
android-ubuntu-e2e-test-ci (x86, 28, default) / Android Ubuntu e2e test (reload_while_tx_pending)
Failed to save cache entry with path '/home/runner/.gradle/caches/8.8/generated-gradle-jars/gradle-api-8.8.jar' and key: gradle-generated-gradle-jars-v1-8b02b97fb417a75a34543e345c4e56f3: Error: Failed to CreateCacheEntry: Received non-retryable error: Failed request: (409) Conflict: cache entry with the same key, version, and scope already exists
android-ubuntu-e2e-test-ci (x86, 28, default) / Android Ubuntu e2e test (reload_while_tx_pending)
Failed to save cache entry with path '/home/runner/.gradle/caches/jars-*/*/' and key: gradle-instrumented-jars-v1-4a30506eb0d948e967d0892fa5c45110: Error: Failed to CreateCacheEntry: Received non-retryable error: Failed request: (409) Conflict: cache entry with the same key, version, and scope already exists
android-ubuntu-e2e-test-ci (x86, 28, default) / Android Ubuntu e2e test (reload_while_tx_pending)
Failed to save cache entry with path '/home/runner/.gradle/caches/*/kotlin-dsl/accessors/*/,/home/runner/.gradle/caches/*/kotlin-dsl/scripts/*/' and key: gradle-kotlin-dsl-v1-9140bde3d9d7a5883115b76f0a435441: Error: Failed to CreateCacheEntry: Received non-retryable error: Failed request: (409) Conflict: cache entry with the same key, version, and scope already exists
android-ubuntu-e2e-test-ci (x86, 28, default) / Android Ubuntu e2e test (reload_while_tx_pending)
Failed to save cache entry with path '/home/runner/.gradle/caches/*/groovy-dsl/*/' and key: gradle-groovy-dsl-v1-910dbffcc305745a058a12e2e70374d3: Error: Failed to CreateCacheEntry: Received non-retryable error: Failed request: (409) Conflict: cache entry with the same key, version, and scope already exists
android-ubuntu-e2e-test-ci (x86, 28, default) / Android Ubuntu e2e test (reload_while_tx_pending)
Failed to save cache entry with path '/home/runner/.gradle/wrapper/dists/gradle-8.8-all/6gdy1pgp427xkqcjbxw3ylt6h' and key: gradle-wrapper-zips-v1-3600859674b461a36bd4c8379d91f6cb: Error: Failed to CreateCacheEntry: Received non-retryable error: Failed request: (409) Conflict: cache entry with the same key, version, and scope already exists
android-ubuntu-e2e-test-ci (x86, 28, default) / Android Ubuntu e2e test (reload_while_tx_pending)
Failed to save cache entry with path '/home/runner/.gradle/caches/modules-*/files-*/*/*/*/*' and key: gradle-dependencies-v1-04a3bf68ca15d37e2f817e3b20e56a5d: Error: Failed to CreateCacheEntry: Received non-retryable error: Failed request: (409) Conflict: cache entry with the same key, version, and scope already exists
android-ubuntu-e2e-test-ci (x86, 28, default) / Android Ubuntu e2e test (reload_while_tx_pending)
Failed to save cache entry with path '/home/runner/.gradle/caches,/home/runner/.gradle/notifications,/home/runner/.gradle/.setup-gradle' and key: gradle-home-v1|Linux-X64|android-ubuntu-e2e-test-ci[c398e2b9e18479761f8d21f134d571bf]-38fa32f09c2ed2042771b3ff957deed0fbe48eb2: Error: Failed to CreateCacheEntry: Received non-retryable error: Failed request: (409) Conflict: cache entry with the same key, version, and scope already exists
android-ubuntu-e2e-test-ci (x86, 28, default) / Android Ubuntu e2e test (reload_while_tx_pending)
Cache not found for keys: v0-rust-android-ubuntu-e2e-test-ci-Linux-6be15664-5abf5f57, v0-rust-android-ubuntu-e2e-test-ci-Linux-6be15664
android-ubuntu-e2e-test-ci (x86_64, 30, default) / Android Ubuntu e2e test (change_custom_testnet_server)
Cache not found for keys: v0-rust-android-ubuntu-e2e-test-ci-Linux-6be15664-da39a3ee, v0-rust-android-ubuntu-e2e-test-ci-Linux-6be15664
android-ubuntu-e2e-test-ci (x86_64, 30, default) / Android Ubuntu e2e test (change_custom_testnet_server)
No files were found with the provided path: android/app/build/outputs/e2e_test_reports. No artifacts will be uploaded.
android-ubuntu-e2e-test-ci (x86_64, 30, default) / Android Ubuntu e2e test (change_custom_testnet_server)
Failed to save cache entry with path '/home/runner/.gradle/caches/8.8/generated-gradle-jars/gradle-api-8.8.jar' and key: gradle-generated-gradle-jars-v1-8b02b97fb417a75a34543e345c4e56f3: Error: Failed to CreateCacheEntry: Received non-retryable error: Failed request: (409) Conflict: cache entry with the same key, version, and scope already exists
android-ubuntu-e2e-test-ci (x86_64, 30, default) / Android Ubuntu e2e test (change_custom_testnet_server)
Failed to save cache entry with path '/home/runner/.gradle/caches/jars-*/*/' and key: gradle-instrumented-jars-v1-4a30506eb0d948e967d0892fa5c45110: Error: Failed to CreateCacheEntry: Received non-retryable error: Failed request: (409) Conflict: cache entry with the same key, version, and scope already exists
android-ubuntu-e2e-test-ci (x86_64, 30, default) / Android Ubuntu e2e test (change_custom_testnet_server)
Failed to save cache entry with path '/home/runner/.gradle/caches/*/kotlin-dsl/accessors/*/,/home/runner/.gradle/caches/*/kotlin-dsl/scripts/*/' and key: gradle-kotlin-dsl-v1-9140bde3d9d7a5883115b76f0a435441: Error: Failed to CreateCacheEntry: Received non-retryable error: Failed request: (409) Conflict: cache entry with the same key, version, and scope already exists
android-ubuntu-e2e-test-ci (x86_64, 30, default) / Android Ubuntu e2e test (change_custom_testnet_server)
Failed to save cache entry with path '/home/runner/.gradle/caches/*/groovy-dsl/*/' and key: gradle-groovy-dsl-v1-910dbffcc305745a058a12e2e70374d3: Error: Failed to CreateCacheEntry: Received non-retryable error: Failed request: (409) Conflict: cache entry with the same key, version, and scope already exists
android-ubuntu-e2e-test-ci (x86_64, 30, default) / Android Ubuntu e2e test (change_custom_testnet_server)
Failed to save cache entry with path '/home/runner/.gradle/wrapper/dists/gradle-8.8-all/6gdy1pgp427xkqcjbxw3ylt6h' and key: gradle-wrapper-zips-v1-3600859674b461a36bd4c8379d91f6cb: Error: Failed to CreateCacheEntry: Received non-retryable error: Failed request: (409) Conflict: cache entry with the same key, version, and scope already exists
android-ubuntu-e2e-test-ci (x86_64, 30, default) / Android Ubuntu e2e test (change_custom_testnet_server)
Failed to save cache entry with path '/home/runner/.gradle/caches/modules-*/files-*/*/*/*/*' and key: gradle-dependencies-v1-04a3bf68ca15d37e2f817e3b20e56a5d: Error: Failed to CreateCacheEntry: Received non-retryable error: Failed request: (409) Conflict: cache entry with the same key, version, and scope already exists
android-ubuntu-e2e-test-ci (x86_64, 30, default) / Android Ubuntu e2e test (change_custom_testnet_server)
Failed to save cache entry with path '/home/runner/.gradle/caches,/home/runner/.gradle/notifications,/home/runner/.gradle/.setup-gradle' and key: gradle-home-v1|Linux-X64|android-ubuntu-e2e-test-ci[1d37fc3886ebf952a6f6eb8b198df14e]-38fa32f09c2ed2042771b3ff957deed0fbe48eb2: Error: Failed to CreateCacheEntry: Received non-retryable error: Failed request: (409) Conflict: cache entry with the same key, version, and scope already exists
android-ubuntu-e2e-test-ci (x86_64, 30, default) / Android Ubuntu e2e test (change_custom_testnet_server)
Cache not found for keys: v0-rust-android-ubuntu-e2e-test-ci-Linux-6be15664-5abf5f57, v0-rust-android-ubuntu-e2e-test-ci-Linux-6be15664
android-ubuntu-e2e-test-ci (x86_64, 30, default) / Android Ubuntu e2e test (change_custom_regtest_server)
Cache not found for keys: v0-rust-android-ubuntu-e2e-test-ci-Linux-6be15664-da39a3ee, v0-rust-android-ubuntu-e2e-test-ci-Linux-6be15664
android-ubuntu-e2e-test-ci (x86_64, 30, default) / Android Ubuntu e2e test (change_custom_regtest_server)
Failed to save cache entry with path '/home/runner/.gradle/caches/8.8/generated-gradle-jars/gradle-api-8.8.jar' and key: gradle-generated-gradle-jars-v1-8b02b97fb417a75a34543e345c4e56f3: Error: Failed to CreateCacheEntry: Received non-retryable error: Failed request: (409) Conflict: cache entry with the same key, version, and scope already exists
android-ubuntu-e2e-test-ci (x86_64, 30, default) / Android Ubuntu e2e test (change_custom_regtest_server)
Failed to save cache entry with path '/home/runner/.gradle/caches/jars-*/*/' and key: gradle-instrumented-jars-v1-4a30506eb0d948e967d0892fa5c45110: Error: Failed to CreateCacheEntry: Received non-retryable error: Failed request: (409) Conflict: cache entry with the same key, version, and scope already exists
android-ubuntu-e2e-test-ci (x86_64, 30, default) / Android Ubuntu e2e test (change_custom_regtest_server)
Failed to save cache entry with path '/home/runner/.gradle/caches/*/kotlin-dsl/accessors/*/,/home/runner/.gradle/caches/*/kotlin-dsl/scripts/*/' and key: gradle-kotlin-dsl-v1-9140bde3d9d7a5883115b76f0a435441: Error: Failed to CreateCacheEntry: Received non-retryable error: Failed request: (409) Conflict: cache entry with the same key, version, and scope already exists
android-ubuntu-e2e-test-ci (x86_64, 30, default) / Android Ubuntu e2e test (change_custom_regtest_server)
Failed to save cache entry with path '/home/runner/.gradle/caches/*/groovy-dsl/*/' and key: gradle-groovy-dsl-v1-910dbffcc305745a058a12e2e70374d3: Error: Failed to CreateCacheEntry: Received non-retryable error: Failed request: (409) Conflict: cache entry with the same key, version, and scope already exists
android-ubuntu-e2e-test-ci (x86_64, 30, default) / Android Ubuntu e2e test (change_custom_regtest_server)
Failed to save cache entry with path '/home/runner/.gradle/wrapper/dists/gradle-8.8-all/6gdy1pgp427xkqcjbxw3ylt6h' and key: gradle-wrapper-zips-v1-3600859674b461a36bd4c8379d91f6cb: Error: Failed to CreateCacheEntry: Received non-retryable error: Failed request: (409) Conflict: cache entry with the same key, version, and scope already exists
android-ubuntu-e2e-test-ci (x86_64, 30, default) / Android Ubuntu e2e test (change_custom_regtest_server)
Failed to save cache entry with path '/home/runner/.gradle/caches/modules-*/files-*/*/*/*/*' and key: gradle-dependencies-v1-04a3bf68ca15d37e2f817e3b20e56a5d: Error: Failed to CreateCacheEntry: Received non-retryable error: Failed request: (409) Conflict: cache entry with the same key, version, and scope already exists
android-ubuntu-e2e-test-ci (x86_64, 30, default) / Android Ubuntu e2e test (change_custom_regtest_server)
Failed to save cache entry with path '/home/runner/.gradle/caches,/home/runner/.gradle/notifications,/home/runner/.gradle/.setup-gradle' and key: gradle-home-v1|Linux-X64|android-ubuntu-e2e-test-ci[d55dd883459173f9439a6264e7c011ff]-38fa32f09c2ed2042771b3ff957deed0fbe48eb2: Error: Failed to CreateCacheEntry: Received non-retryable error: Failed request: (409) Conflict: cache entry with the same key, version, and scope already exists
android-ubuntu-e2e-test-ci (x86_64, 30, default) / Android Ubuntu e2e test (change_custom_regtest_server)
Cache not found for keys: v0-rust-android-ubuntu-e2e-test-ci-Linux-6be15664-5abf5f57, v0-rust-android-ubuntu-e2e-test-ci-Linux-6be15664
android-ubuntu-e2e-test-ci (x86_64, 30, default) / Android Ubuntu e2e test (change_custom_regtest_server)
No files were found with the provided path: android/app/build/outputs/e2e_test_reports. No artifacts will be uploaded.
android-ubuntu-e2e-test-ci (x86, 28, default) / Android Ubuntu e2e test (sync_report)
Cache not found for keys: v0-rust-android-ubuntu-e2e-test-ci-Linux-6be15664-da39a3ee, v0-rust-android-ubuntu-e2e-test-ci-Linux-6be15664
android-ubuntu-e2e-test-ci (x86, 28, default) / Android Ubuntu e2e test (sync_report)
Cache not found for keys: v0-rust-android-ubuntu-e2e-test-ci-Linux-6be15664-5abf5f57, v0-rust-android-ubuntu-e2e-test-ci-Linux-6be15664
android-ubuntu-e2e-test-ci (x86, 28, default) / Android Ubuntu e2e test (sync_report)
No files were found with the provided path: android/app/build/outputs/e2e_test_reports. No artifacts will be uploaded.
android-ubuntu-e2e-test-ci (x86, 28, default) / Android Ubuntu e2e test (sync_report)
Failed to save cache entry with path '/home/runner/.gradle/caches/8.8/generated-gradle-jars/gradle-api-8.8.jar' and key: gradle-generated-gradle-jars-v1-8b02b97fb417a75a34543e345c4e56f3: Error: Failed to CreateCacheEntry: Received non-retryable error: Failed request: (409) Conflict: cache entry with the same key, version, and scope already exists
android-ubuntu-e2e-test-ci (x86, 28, default) / Android Ubuntu e2e test (sync_report)
Failed to save cache entry with path '/home/runner/.gradle/caches/jars-*/*/' and key: gradle-instrumented-jars-v1-4a30506eb0d948e967d0892fa5c45110: Error: Failed to CreateCacheEntry: Received non-retryable error: Failed request: (409) Conflict: cache entry with the same key, version, and scope already exists
android-ubuntu-e2e-test-ci (x86, 28, default) / Android Ubuntu e2e test (sync_report)
Failed to save cache entry with path '/home/runner/.gradle/caches/*/kotlin-dsl/accessors/*/,/home/runner/.gradle/caches/*/kotlin-dsl/scripts/*/' and key: gradle-kotlin-dsl-v1-9140bde3d9d7a5883115b76f0a435441: Error: Failed to CreateCacheEntry: Received non-retryable error: Failed request: (409) Conflict: cache entry with the same key, version, and scope already exists
android-ubuntu-e2e-test-ci (x86, 28, default) / Android Ubuntu e2e test (sync_report)
Failed to save cache entry with path '/home/runner/.gradle/caches/*/groovy-dsl/*/' and key: gradle-groovy-dsl-v1-910dbffcc305745a058a12e2e70374d3: Error: Failed to CreateCacheEntry: Received non-retryable error: Failed request: (409) Conflict: cache entry with the same key, version, and scope already exists
android-ubuntu-e2e-test-ci (x86, 28, default) / Android Ubuntu e2e test (sync_report)
Failed to save cache entry with path '/home/runner/.gradle/caches/modules-*/files-*/*/*/*/*' and key: gradle-dependencies-v1-04a3bf68ca15d37e2f817e3b20e56a5d: Error: Failed to CreateCacheEntry: Received non-retryable error: Failed request: (409) Conflict: cache entry with the same key, version, and scope already exists
android-ubuntu-e2e-test-ci (x86, 28, default) / Android Ubuntu e2e test (sync_report)
Failed to save cache entry with path '/home/runner/.gradle/wrapper/dists/gradle-8.8-all/6gdy1pgp427xkqcjbxw3ylt6h' and key: gradle-wrapper-zips-v1-3600859674b461a36bd4c8379d91f6cb: Error: Failed to CreateCacheEntry: Received non-retryable error: Failed request: (409) Conflict: cache entry with the same key, version, and scope already exists
android-ubuntu-e2e-test-ci (x86, 28, default) / Android Ubuntu e2e test (sync_report)
Failed to save cache entry with path '/home/runner/.gradle/caches,/home/runner/.gradle/notifications,/home/runner/.gradle/.setup-gradle' and key: gradle-home-v1|Linux-X64|android-ubuntu-e2e-test-ci[e4f204e7495522cab18906e3ddd7867e]-38fa32f09c2ed2042771b3ff957deed0fbe48eb2: Error: Failed to CreateCacheEntry: Received non-retryable error: Failed request: (409) Conflict: cache entry with the same key, version, and scope already exists
android-ubuntu-e2e-test-ci (x86, 28, default) / Android Ubuntu e2e test (send)
Cache not found for keys: v0-rust-android-ubuntu-e2e-test-ci-Linux-6be15664-da39a3ee, v0-rust-android-ubuntu-e2e-test-ci-Linux-6be15664
android-ubuntu-e2e-test-ci (x86, 28, default) / Android Ubuntu e2e test (send)
Cache not found for keys: v0-rust-android-ubuntu-e2e-test-ci-Linux-6be15664-5abf5f57, v0-rust-android-ubuntu-e2e-test-ci-Linux-6be15664
android-ubuntu-e2e-test-ci (x86, 28, default) / Android Ubuntu e2e test (send)
Failed to save cache entry with path '/home/runner/.gradle/caches/8.8/generated-gradle-jars/gradle-api-8.8.jar' and key: gradle-generated-gradle-jars-v1-8b02b97fb417a75a34543e345c4e56f3: Error: Failed to CreateCacheEntry: Received non-retryable error: Failed request: (409) Conflict: cache entry with the same key, version, and scope already exists
android-ubuntu-e2e-test-ci (x86, 28, default) / Android Ubuntu e2e test (send)
Failed to save cache entry with path '/home/runner/.gradle/caches/jars-*/*/' and key: gradle-instrumented-jars-v1-4a30506eb0d948e967d0892fa5c45110: Error: Failed to CreateCacheEntry: Received non-retryable error: Failed request: (409) Conflict: cache entry with the same key, version, and scope already exists
android-ubuntu-e2e-test-ci (x86, 28, default) / Android Ubuntu e2e test (send)
Failed to save cache entry with path '/home/runner/.gradle/caches/*/kotlin-dsl/accessors/*/,/home/runner/.gradle/caches/*/kotlin-dsl/scripts/*/' and key: gradle-kotlin-dsl-v1-9140bde3d9d7a5883115b76f0a435441: Error: Failed to CreateCacheEntry: Received non-retryable error: Failed request: (409) Conflict: cache entry with the same key, version, and scope already exists
android-ubuntu-e2e-test-ci (x86, 28, default) / Android Ubuntu e2e test (send)
Failed to save cache entry with path '/home/runner/.gradle/caches/*/groovy-dsl/*/' and key: gradle-groovy-dsl-v1-910dbffcc305745a058a12e2e70374d3: Error: Failed to CreateCacheEntry: Received non-retryable error: Failed request: (409) Conflict: cache entry with the same key, version, and scope already exists
android-ubuntu-e2e-test-ci (x86, 28, default) / Android Ubuntu e2e test (send)
Failed to save cache entry with path '/home/runner/.gradle/wrapper/dists/gradle-8.8-all/6gdy1pgp427xkqcjbxw3ylt6h' and key: gradle-wrapper-zips-v1-3600859674b461a36bd4c8379d91f6cb: Error: Failed to CreateCacheEntry: Received non-retryable error: Failed request: (409) Conflict: cache entry with the same key, version, and scope already exists
android-ubuntu-e2e-test-ci (x86, 28, default) / Android Ubuntu e2e test (send)
Failed to save cache entry with path '/home/runner/.gradle/caches/modules-*/files-*/*/*/*/*' and key: gradle-dependencies-v1-04a3bf68ca15d37e2f817e3b20e56a5d: Error: Failed to CreateCacheEntry: Received non-retryable error: Failed request: (409) Conflict: cache entry with the same key, version, and scope already exists
android-ubuntu-e2e-test-ci (x86, 28, default) / Android Ubuntu e2e test (send)
Failed to save cache entry with path '/home/runner/.gradle/caches,/home/runner/.gradle/notifications,/home/runner/.gradle/.setup-gradle' and key: gradle-home-v1|Linux-X64|android-ubuntu-e2e-test-ci[38fba71927aaada028815f0fb6334a70]-38fa32f09c2ed2042771b3ff957deed0fbe48eb2: Error: Failed to CreateCacheEntry: Received non-retryable error: Failed request: (409) Conflict: cache entry with the same key, version, and scope already exists
android-ubuntu-e2e-test-ci (x86, 28, default) / Android Ubuntu e2e test (send)
No files were found with the provided path: android/app/build/outputs/e2e_test_reports. No artifacts will be uploaded.
android-ubuntu-e2e-test-ci (x86_64, 30, default) / Android Ubuntu e2e test (change_custom_server)
Cache not found for keys: v0-rust-android-ubuntu-e2e-test-ci-Linux-6be15664-da39a3ee, v0-rust-android-ubuntu-e2e-test-ci-Linux-6be15664
android-ubuntu-e2e-test-ci (x86_64, 30, default) / Android Ubuntu e2e test (change_custom_server)
Cache not found for keys: v0-rust-android-ubuntu-e2e-test-ci-Linux-6be15664-5abf5f57, v0-rust-android-ubuntu-e2e-test-ci-Linux-6be15664
android-ubuntu-e2e-test-ci (x86_64, 30, default) / Android Ubuntu e2e test (change_custom_server)
No files were found with the provided path: android/app/build/outputs/e2e_test_reports. No artifacts will be uploaded.
android-ubuntu-e2e-test-ci (x86_64, 30, default) / Android Ubuntu e2e test (change_custom_server)
Failed to save cache entry with path '/home/runner/.gradle/caches/8.8/generated-gradle-jars/gradle-api-8.8.jar' and key: gradle-generated-gradle-jars-v1-8b02b97fb417a75a34543e345c4e56f3: Error: Failed to CreateCacheEntry: Received non-retryable error: Failed request: (409) Conflict: cache entry with the same key, version, and scope already exists
android-ubuntu-e2e-test-ci (x86_64, 30, default) / Android Ubuntu e2e test (change_custom_server)
Failed to save cache entry with path '/home/runner/.gradle/caches/jars-*/*/' and key: gradle-instrumented-jars-v1-4a30506eb0d948e967d0892fa5c45110: Error: Failed to CreateCacheEntry: Received non-retryable error: Failed request: (409) Conflict: cache entry with the same key, version, and scope already exists
android-ubuntu-e2e-test-ci (x86_64, 30, default) / Android Ubuntu e2e test (change_custom_server)
Failed to save cache entry with path '/home/runner/.gradle/caches/*/kotlin-dsl/accessors/*/,/home/runner/.gradle/caches/*/kotlin-dsl/scripts/*/' and key: gradle-kotlin-dsl-v1-9140bde3d9d7a5883115b76f0a435441: Error: Failed to CreateCacheEntry: Received non-retryable error: Failed request: (409) Conflict: cache entry with the same key, version, and scope already exists
android-ubuntu-e2e-test-ci (x86_64, 30, default) / Android Ubuntu e2e test (change_custom_server)
Failed to save cache entry with path '/home/runner/.gradle/caches/*/groovy-dsl/*/' and key: gradle-groovy-dsl-v1-910dbffcc305745a058a12e2e70374d3: Error: Failed to CreateCacheEntry: Received non-retryable error: Failed request: (409) Conflict: cache entry with the same key, version, and scope already exists
android-ubuntu-e2e-test-ci (x86_64, 30, default) / Android Ubuntu e2e test (change_custom_server)
Failed to save cache entry with path '/home/runner/.gradle/wrapper/dists/gradle-8.8-all/6gdy1pgp427xkqcjbxw3ylt6h' and key: gradle-wrapper-zips-v1-3600859674b461a36bd4c8379d91f6cb: Error: Failed to CreateCacheEntry: Received non-retryable error: Failed request: (409) Conflict: cache entry with the same key, version, and scope already exists
android-ubuntu-e2e-test-ci (x86_64, 30, default) / Android Ubuntu e2e test (change_custom_server)
Failed to save cache entry with path '/home/runner/.gradle/caches/modules-*/files-*/*/*/*/*' and key: gradle-dependencies-v1-04a3bf68ca15d37e2f817e3b20e56a5d: Error: Failed to CreateCacheEntry: Received non-retryable error: Failed request: (409) Conflict: cache entry with the same key, version, and scope already exists
android-ubuntu-e2e-test-ci (x86_64, 30, default) / Android Ubuntu e2e test (change_custom_server)
Failed to save cache entry with path '/home/runner/.gradle/caches,/home/runner/.gradle/notifications,/home/runner/.gradle/.setup-gradle' and key: gradle-home-v1|Linux-X64|android-ubuntu-e2e-test-ci[e5f671a36bc91fd6cd6035883a14974d]-38fa32f09c2ed2042771b3ff957deed0fbe48eb2: Error: Failed to CreateCacheEntry: Received non-retryable error: Failed request: (409) Conflict: cache entry with the same key, version, and scope already exists
android-ubuntu-e2e-test-ci (x86, 28, default) / Android Ubuntu e2e test (new_wallet)
Failed to save cache entry with path '/home/runner/.gradle/caches/8.8/generated-gradle-jars/gradle-api-8.8.jar' and key: gradle-generated-gradle-jars-v1-8b02b97fb417a75a34543e345c4e56f3: Error: Failed to CreateCacheEntry: Received non-retryable error: Failed request: (409) Conflict: cache entry with the same key, version, and scope already exists
android-ubuntu-e2e-test-ci (x86, 28, default) / Android Ubuntu e2e test (new_wallet)
Failed to save cache entry with path '/home/runner/.gradle/caches/jars-*/*/' and key: gradle-instrumented-jars-v1-4a30506eb0d948e967d0892fa5c45110: Error: Failed to CreateCacheEntry: Received non-retryable error: Failed request: (409) Conflict: cache entry with the same key, version, and scope already exists
android-ubuntu-e2e-test-ci (x86, 28, default) / Android Ubuntu e2e test (new_wallet)
Failed to save cache entry with path '/home/runner/.gradle/caches/*/kotlin-dsl/accessors/*/,/home/runner/.gradle/caches/*/kotlin-dsl/scripts/*/' and key: gradle-kotlin-dsl-v1-9140bde3d9d7a5883115b76f0a435441: Error: Failed to CreateCacheEntry: Received non-retryable error: Failed request: (409) Conflict: cache entry with the same key, version, and scope already exists
android-ubuntu-e2e-test-ci (x86, 28, default) / Android Ubuntu e2e test (new_wallet)
Failed to save cache entry with path '/home/runner/.gradle/caches/*/groovy-dsl/*/' and key: gradle-groovy-dsl-v1-910dbffcc305745a058a12e2e70374d3: Error: Failed to CreateCacheEntry: Received non-retryable error: Failed request: (409) Conflict: cache entry with the same key, version, and scope already exists
android-ubuntu-e2e-test-ci (x86, 28, default) / Android Ubuntu e2e test (new_wallet)
Failed to save cache entry with path '/home/runner/.gradle/caches/modules-*/files-*/*/*/*/*' and key: gradle-dependencies-v1-04a3bf68ca15d37e2f817e3b20e56a5d: Error: Failed to CreateCacheEntry: Received non-retryable error: Failed request: (409) Conflict: cache entry with the same key, version, and scope already exists
android-ubuntu-e2e-test-ci (x86, 28, default) / Android Ubuntu e2e test (new_wallet)
Failed to save cache entry with path '/home/runner/.gradle/wrapper/dists/gradle-8.8-all/6gdy1pgp427xkqcjbxw3ylt6h' and key: gradle-wrapper-zips-v1-3600859674b461a36bd4c8379d91f6cb: Error: Failed to CreateCacheEntry: Received non-retryable error: Failed request: (409) Conflict: cache entry with the same key, version, and scope already exists
android-ubuntu-e2e-test-ci (x86, 28, default) / Android Ubuntu e2e test (new_wallet)
Failed to save cache entry with path '/home/runner/.gradle/caches,/home/runner/.gradle/notifications,/home/runner/.gradle/.setup-gradle' and key: gradle-home-v1|Linux-X64|android-ubuntu-e2e-test-ci[226c9871c738926247e438bdb5af8ab2]-38fa32f09c2ed2042771b3ff957deed0fbe48eb2: Error: Failed to CreateCacheEntry: Received non-retryable error: Failed request: (409) Conflict: cache entry with the same key, version, and scope already exists
android-ubuntu-e2e-test-ci (x86, 28, default) / Android Ubuntu e2e test (new_wallet)
Cache not found for keys: v0-rust-android-ubuntu-e2e-test-ci-Linux-6be15664-5abf5f57, v0-rust-android-ubuntu-e2e-test-ci-Linux-6be15664
android-ubuntu-e2e-test-ci (x86, 28, default) / Android Ubuntu e2e test (new_wallet)
No files were found with the provided path: android/app/build/outputs/e2e_test_reports. No artifacts will be uploaded.
android-ubuntu-integration-test-ci (x86, 29, default) / Android Ubuntu Integration test (offline_testsuite)
Runner GitHub Actions 47 did not respond to a cancelation request with 00:05:00.
android-ubuntu-integration-test-ci (x86, 29, default) / Android Ubuntu Integration test (execute_sapling_balance_from_seed)
Runner GitHub Actions 20 did not respond to a cancelation request with 00:05:00.