Bump react-native
to 0.75.5
#4131
Triggered via pull request
February 18, 2025 18:21
Status
Cancelled
Total duration
39m 52s
Artifacts
–
ci.yaml
on: pull_request
create-timestamp
/
Create timestamp
2s
create-cache-key
/
Create cache key
6s
jest-test
/
Jest test
2m 24s
Matrix: android-build
Matrix: android-ubuntu-e2e-test-ci
Matrix: android-ubuntu-integration-test-ci
ios-integration-test
/
IOS Integration test
30m 55s
Annotations
39 errors and 123 warnings
android-ubuntu-e2e-test-ci (x86_64, 30, default) / Android Ubuntu e2e test (tex_send_address)
Process completed with exit code 1.
|
android-ubuntu-e2e-test-ci (x86, 28, default) / Android Ubuntu e2e test (change_custom_server)
Process completed with exit code 1.
|
android-ubuntu-e2e-test-ci (x86, 28, default) / Android Ubuntu e2e test (send)
Process completed with exit code 1.
|
android-ubuntu-e2e-test-ci (x86_64, 30, default) / Android Ubuntu e2e test (sync_report)
Process completed with exit code 1.
|
android-ubuntu-e2e-test-ci (x86, 28, default) / Android Ubuntu e2e test (change_custom_regtest_server)
Process completed with exit code 1.
|
android-ubuntu-e2e-test-ci (x86_64, 30, default) / Android Ubuntu e2e test (change_custom_regtest_server)
Process completed with exit code 1.
|
android-ubuntu-integration-test-ci (x86, 29, default) / Android Ubuntu Integration test (offline_testsuite)
System.IO.IOException: No space left on device : '/home/runner/runners/2.322.0/_diag/Worker_20250218-183049-utc.log'
at System.IO.RandomAccess.WriteAtOffset(SafeFileHandle handle, ReadOnlySpan`1 buffer, Int64 fileOffset)
at System.IO.StreamWriter.Flush(Boolean flushStream, Boolean flushEncoder)
at System.Diagnostics.TextWriterTraceListener.Flush()
at GitHub.Runner.Common.HostTraceListener.WriteHeader(String source, TraceEventType eventType, Int32 id)
at System.Diagnostics.TraceSource.TraceEvent(TraceEventType eventType, Int32 id, String message)
at GitHub.Runner.Worker.Worker.RunAsync(String pipeIn, String pipeOut)
at GitHub.Runner.Worker.Program.MainAsync(IHostContext context, String[] args)
System.IO.IOException: No space left on device : '/home/runner/runners/2.322.0/_diag/Worker_20250218-183049-utc.log'
at System.IO.RandomAccess.WriteAtOffset(SafeFileHandle handle, ReadOnlySpan`1 buffer, Int64 fileOffset)
at System.IO.StreamWriter.Flush(Boolean flushStream, Boolean flushEncoder)
at System.Diagnostics.TextWriterTraceListener.Flush()
at GitHub.Runner.Common.HostTraceListener.WriteHeader(String source, TraceEventType eventType, Int32 id)
at System.Diagnostics.TraceSource.TraceEvent(TraceEventType eventType, Int32 id, String message)
at GitHub.Runner.Common.Tracing.Error(Exception exception)
at GitHub.Runner.Worker.Program.MainAsync(IHostContext context, String[] args)
Unhandled exception. System.IO.IOException: No space left on device : '/home/runner/runners/2.322.0/_diag/Worker_20250218-183049-utc.log'
at System.IO.RandomAccess.WriteAtOffset(SafeFileHandle handle, ReadOnlySpan`1 buffer, Int64 fileOffset)
at System.IO.StreamWriter.Flush(Boolean flushStream, Boolean flushEncoder)
at System.Diagnostics.TextWriterTraceListener.Flush()
at System.Diagnostics.TraceSource.Flush()
at GitHub.Runner.Common.Tracing.Dispose(Boolean disposing)
at GitHub.Runner.Common.Tracing.Dispose()
at GitHub.Runner.Common.TraceManager.Dispose(Boolean disposing)
at GitHub.Runner.Common.TraceManager.Dispose()
at GitHub.Runner.Common.HostContext.Dispose(Boolean disposing)
at GitHub.Runner.Common.HostContext.Dispose()
at GitHub.Runner.Worker.Program.Main(String[] args)
|
android-ubuntu-e2e-test-ci (x86, 28, default) / Android Ubuntu e2e test (shielding)
Process completed with exit code 1.
|
android-ubuntu-e2e-test-ci (x86_64, 30, default) / Android Ubuntu e2e test (reload_while_tx_pending)
Process completed with exit code 1.
|
android-ubuntu-integration-test-ci (x86, 29, default) / Android Ubuntu Integration test (execute_parse_addresses)
System.IO.IOException: No space left on device : '/home/runner/runners/2.322.0/_diag/Worker_20250218-183048-utc.log'
at System.IO.RandomAccess.WriteAtOffset(SafeFileHandle handle, ReadOnlySpan`1 buffer, Int64 fileOffset)
at System.IO.StreamWriter.Flush(Boolean flushStream, Boolean flushEncoder)
at System.Diagnostics.TextWriterTraceListener.Flush()
at GitHub.Runner.Common.HostTraceListener.WriteHeader(String source, TraceEventType eventType, Int32 id)
at System.Diagnostics.TraceSource.TraceEvent(TraceEventType eventType, Int32 id, String message)
at GitHub.Runner.Worker.Worker.RunAsync(String pipeIn, String pipeOut)
at GitHub.Runner.Worker.Program.MainAsync(IHostContext context, String[] args)
System.IO.IOException: No space left on device : '/home/runner/runners/2.322.0/_diag/Worker_20250218-183048-utc.log'
at System.IO.RandomAccess.WriteAtOffset(SafeFileHandle handle, ReadOnlySpan`1 buffer, Int64 fileOffset)
at System.IO.StreamWriter.Flush(Boolean flushStream, Boolean flushEncoder)
at System.Diagnostics.TextWriterTraceListener.Flush()
at GitHub.Runner.Common.HostTraceListener.WriteHeader(String source, TraceEventType eventType, Int32 id)
at System.Diagnostics.TraceSource.TraceEvent(TraceEventType eventType, Int32 id, String message)
at GitHub.Runner.Common.Tracing.Error(Exception exception)
at GitHub.Runner.Worker.Program.MainAsync(IHostContext context, String[] args)
Unhandled exception. System.IO.IOException: No space left on device : '/home/runner/runners/2.322.0/_diag/Worker_20250218-183048-utc.log'
at System.IO.RandomAccess.WriteAtOffset(SafeFileHandle handle, ReadOnlySpan`1 buffer, Int64 fileOffset)
at System.IO.StreamWriter.Flush(Boolean flushStream, Boolean flushEncoder)
at System.Diagnostics.TextWriterTraceListener.Flush()
at System.Diagnostics.TraceSource.Flush()
at GitHub.Runner.Common.Tracing.Dispose(Boolean disposing)
at GitHub.Runner.Common.Tracing.Dispose()
at GitHub.Runner.Common.TraceManager.Dispose(Boolean disposing)
at GitHub.Runner.Common.TraceManager.Dispose()
at GitHub.Runner.Common.HostContext.Dispose(Boolean disposing)
at GitHub.Runner.Common.HostContext.Dispose()
at GitHub.Runner.Worker.Program.Main(String[] args)
|
android-ubuntu-e2e-test-ci (x86, 28, default) / Android Ubuntu e2e test (parse_invalid_address)
Process completed with exit code 1.
|
android-ubuntu-e2e-test-ci (x86, 28, default) / Android Ubuntu e2e test (change_server_from_list)
Process completed with exit code 1.
|
android-ubuntu-e2e-test-ci (x86, 28, default) / Android Ubuntu e2e test (tex_send_address)
Process completed with exit code 1.
|
android-ubuntu-e2e-test-ci (x86_64, 30, default) / Android Ubuntu e2e test (shielding)
Process completed with exit code 1.
|
android-ubuntu-e2e-test-ci (x86, 28, default) / Android Ubuntu e2e test (new_wallet)
Process completed with exit code 1.
|
android-ubuntu-e2e-test-ci (x86, 28, default) / Android Ubuntu e2e test (sync_report)
Process completed with exit code 1.
|
android-ubuntu-e2e-test-ci (x86_64, 30, default) / Android Ubuntu e2e test (change_server_from_list)
Process completed with exit code 1.
|
android-ubuntu-e2e-test-ci (x86, 28, default) / Android Ubuntu e2e test (reload_while_tx_pending)
Process completed with exit code 1.
|
android-ubuntu-integration-test-ci (x86_64, 34, default) / Android Ubuntu Integration test (execute_sync_from_seed)
Process completed with exit code 1.
|
android-ubuntu-integration-test-ci (x86_64, 34, default) / Android Ubuntu Integration test (offline_testsuite)
Process completed with exit code 1.
|
android-ubuntu-integration-test-ci (x86_64, 34, default) / Android Ubuntu Integration test (execute_send_from_orchard)
Process completed with exit code 1.
|
android-ubuntu-integration-test-ci (x86_64, 34, default) / Android Ubuntu Integration test (execute_currentprice_and_value_transfers_from_seed)
Process completed with exit code 1.
|
android-ubuntu-integration-test-ci (x86, 29, default) / Android Ubuntu Integration test (execute_sapling_balance_from_seed)
System.IO.IOException: No space left on device : '/home/runner/runners/2.322.0/_diag/Worker_20250218-183048-utc.log'
at System.IO.RandomAccess.WriteAtOffset(SafeFileHandle handle, ReadOnlySpan`1 buffer, Int64 fileOffset)
at System.IO.StreamWriter.Flush(Boolean flushStream, Boolean flushEncoder)
at System.Diagnostics.TextWriterTraceListener.Flush()
at GitHub.Runner.Common.HostTraceListener.WriteHeader(String source, TraceEventType eventType, Int32 id)
at System.Diagnostics.TraceSource.TraceEvent(TraceEventType eventType, Int32 id, String message)
at GitHub.Runner.Worker.Worker.RunAsync(String pipeIn, String pipeOut)
at GitHub.Runner.Worker.Program.MainAsync(IHostContext context, String[] args)
System.IO.IOException: No space left on device : '/home/runner/runners/2.322.0/_diag/Worker_20250218-183048-utc.log'
at System.IO.RandomAccess.WriteAtOffset(SafeFileHandle handle, ReadOnlySpan`1 buffer, Int64 fileOffset)
at System.IO.StreamWriter.Flush(Boolean flushStream, Boolean flushEncoder)
at System.Diagnostics.TextWriterTraceListener.Flush()
at GitHub.Runner.Common.HostTraceListener.WriteHeader(String source, TraceEventType eventType, Int32 id)
at System.Diagnostics.TraceSource.TraceEvent(TraceEventType eventType, Int32 id, String message)
at GitHub.Runner.Common.Tracing.Error(Exception exception)
at GitHub.Runner.Worker.Program.MainAsync(IHostContext context, String[] args)
Unhandled exception. System.IO.IOException: No space left on device : '/home/runner/runners/2.322.0/_diag/Worker_20250218-183048-utc.log'
at System.IO.RandomAccess.WriteAtOffset(SafeFileHandle handle, ReadOnlySpan`1 buffer, Int64 fileOffset)
at System.IO.StreamWriter.Flush(Boolean flushStream, Boolean flushEncoder)
at System.Diagnostics.TextWriterTraceListener.Flush()
at System.Diagnostics.TraceSource.Flush()
at GitHub.Runner.Common.Tracing.Dispose(Boolean disposing)
at GitHub.Runner.Common.Tracing.Dispose()
at GitHub.Runner.Common.TraceManager.Dispose(Boolean disposing)
at GitHub.Runner.Common.TraceManager.Dispose()
at GitHub.Runner.Common.HostContext.Dispose(Boolean disposing)
at GitHub.Runner.Common.HostContext.Dispose()
at GitHub.Runner.Worker.Program.Main(String[] args)
|
android-ubuntu-e2e-test-ci (x86_64, 30, default) / Android Ubuntu e2e test (screen_awake)
Process completed with exit code 1.
|
android-ubuntu-integration-test-ci (x86, 29, default) / Android Ubuntu Integration test (execute_currentprice_and_value_transfers_from_seed)
System.IO.IOException: No space left on device : '/home/runner/runners/2.322.0/_diag/Worker_20250218-183047-utc.log'
at System.IO.RandomAccess.WriteAtOffset(SafeFileHandle handle, ReadOnlySpan`1 buffer, Int64 fileOffset)
at System.IO.StreamWriter.Flush(Boolean flushStream, Boolean flushEncoder)
at System.Diagnostics.TextWriterTraceListener.Flush()
at GitHub.Runner.Common.HostTraceListener.WriteHeader(String source, TraceEventType eventType, Int32 id)
at System.Diagnostics.TraceSource.TraceEvent(TraceEventType eventType, Int32 id, String message)
at GitHub.Runner.Worker.Worker.RunAsync(String pipeIn, String pipeOut)
at GitHub.Runner.Worker.Program.MainAsync(IHostContext context, String[] args)
System.IO.IOException: No space left on device : '/home/runner/runners/2.322.0/_diag/Worker_20250218-183047-utc.log'
at System.IO.RandomAccess.WriteAtOffset(SafeFileHandle handle, ReadOnlySpan`1 buffer, Int64 fileOffset)
at System.IO.StreamWriter.Flush(Boolean flushStream, Boolean flushEncoder)
at System.Diagnostics.TextWriterTraceListener.Flush()
at GitHub.Runner.Common.HostTraceListener.WriteHeader(String source, TraceEventType eventType, Int32 id)
at System.Diagnostics.TraceSource.TraceEvent(TraceEventType eventType, Int32 id, String message)
at GitHub.Runner.Common.Tracing.Error(Exception exception)
at GitHub.Runner.Worker.Program.MainAsync(IHostContext context, String[] args)
Unhandled exception. System.IO.IOException: No space left on device : '/home/runner/runners/2.322.0/_diag/Worker_20250218-183047-utc.log'
at System.IO.RandomAccess.WriteAtOffset(SafeFileHandle handle, ReadOnlySpan`1 buffer, Int64 fileOffset)
at System.IO.StreamWriter.Flush(Boolean flushStream, Boolean flushEncoder)
at System.Diagnostics.TextWriterTraceListener.Flush()
at System.Diagnostics.TraceSource.Flush()
at GitHub.Runner.Common.Tracing.Dispose(Boolean disposing)
at GitHub.Runner.Common.Tracing.Dispose()
at GitHub.Runner.Common.TraceManager.Dispose(Boolean disposing)
at GitHub.Runner.Common.TraceManager.Dispose()
at GitHub.Runner.Common.HostContext.Dispose(Boolean disposing)
at GitHub.Runner.Common.HostContext.Dispose()
at GitHub.Runner.Worker.Program.Main(String[] args)
|
android-ubuntu-e2e-test-ci (x86_64, 30, default) / Android Ubuntu e2e test (new_wallet)
Process completed with exit code 1.
|
android-ubuntu-e2e-test-ci (x86_64, 30, default) / Android Ubuntu e2e test (change_custom_testnet_server)
Process completed with exit code 1.
|
android-ubuntu-integration-test-ci (x86, 29, default) / Android Ubuntu Integration test (execute_sync_from_seed)
System.IO.IOException: No space left on device : '/home/runner/runners/2.322.0/_diag/Worker_20250218-183048-utc.log'
at System.IO.RandomAccess.WriteAtOffset(SafeFileHandle handle, ReadOnlySpan`1 buffer, Int64 fileOffset)
at System.IO.StreamWriter.Flush(Boolean flushStream, Boolean flushEncoder)
at System.Diagnostics.TextWriterTraceListener.Flush()
at GitHub.Runner.Common.HostTraceListener.WriteHeader(String source, TraceEventType eventType, Int32 id)
at System.Diagnostics.TraceSource.TraceEvent(TraceEventType eventType, Int32 id, String message)
at GitHub.Runner.Worker.Worker.RunAsync(String pipeIn, String pipeOut)
at GitHub.Runner.Worker.Program.MainAsync(IHostContext context, String[] args)
System.IO.IOException: No space left on device : '/home/runner/runners/2.322.0/_diag/Worker_20250218-183048-utc.log'
at System.IO.RandomAccess.WriteAtOffset(SafeFileHandle handle, ReadOnlySpan`1 buffer, Int64 fileOffset)
at System.IO.StreamWriter.Flush(Boolean flushStream, Boolean flushEncoder)
at System.Diagnostics.TextWriterTraceListener.Flush()
at GitHub.Runner.Common.HostTraceListener.WriteHeader(String source, TraceEventType eventType, Int32 id)
at System.Diagnostics.TraceSource.TraceEvent(TraceEventType eventType, Int32 id, String message)
at GitHub.Runner.Common.Tracing.Error(Exception exception)
at GitHub.Runner.Worker.Program.MainAsync(IHostContext context, String[] args)
Unhandled exception. System.IO.IOException: No space left on device : '/home/runner/runners/2.322.0/_diag/Worker_20250218-183048-utc.log'
at System.IO.RandomAccess.WriteAtOffset(SafeFileHandle handle, ReadOnlySpan`1 buffer, Int64 fileOffset)
at System.IO.StreamWriter.Flush(Boolean flushStream, Boolean flushEncoder)
at System.Diagnostics.TextWriterTraceListener.Flush()
at System.Diagnostics.TraceSource.Flush()
at GitHub.Runner.Common.Tracing.Dispose(Boolean disposing)
at GitHub.Runner.Common.Tracing.Dispose()
at GitHub.Runner.Common.TraceManager.Dispose(Boolean disposing)
at GitHub.Runner.Common.TraceManager.Dispose()
at GitHub.Runner.Common.HostContext.Dispose(Boolean disposing)
at GitHub.Runner.Common.HostContext.Dispose()
at GitHub.Runner.Worker.Program.Main(String[] args)
|
android-ubuntu-integration-test-ci (x86_64, 34, default) / Android Ubuntu Integration test (execute_parse_addresses)
Process completed with exit code 1.
|
android-ubuntu-e2e-test-ci (x86, 28, default) / Android Ubuntu e2e test (change_custom_testnet_server)
Process completed with exit code 1.
|
android-ubuntu-integration-test-ci (x86, 29, default) / Android Ubuntu Integration test (execute_send_from_orchard)
System.IO.IOException: No space left on device : '/home/runner/runners/2.322.0/_diag/Worker_20250218-183048-utc.log'
at System.IO.RandomAccess.WriteAtOffset(SafeFileHandle handle, ReadOnlySpan`1 buffer, Int64 fileOffset)
at System.IO.StreamWriter.Flush(Boolean flushStream, Boolean flushEncoder)
at System.Diagnostics.TextWriterTraceListener.Flush()
at GitHub.Runner.Common.HostTraceListener.WriteHeader(String source, TraceEventType eventType, Int32 id)
at System.Diagnostics.TraceSource.TraceEvent(TraceEventType eventType, Int32 id, String message)
at GitHub.Runner.Worker.Worker.RunAsync(String pipeIn, String pipeOut)
at GitHub.Runner.Worker.Program.MainAsync(IHostContext context, String[] args)
System.IO.IOException: No space left on device : '/home/runner/runners/2.322.0/_diag/Worker_20250218-183048-utc.log'
at System.IO.RandomAccess.WriteAtOffset(SafeFileHandle handle, ReadOnlySpan`1 buffer, Int64 fileOffset)
at System.IO.StreamWriter.Flush(Boolean flushStream, Boolean flushEncoder)
at System.Diagnostics.TextWriterTraceListener.Flush()
at GitHub.Runner.Common.HostTraceListener.WriteHeader(String source, TraceEventType eventType, Int32 id)
at System.Diagnostics.TraceSource.TraceEvent(TraceEventType eventType, Int32 id, String message)
at GitHub.Runner.Common.Tracing.Error(Exception exception)
at GitHub.Runner.Worker.Program.MainAsync(IHostContext context, String[] args)
Unhandled exception. System.IO.IOException: No space left on device : '/home/runner/runners/2.322.0/_diag/Worker_20250218-183048-utc.log'
at System.IO.RandomAccess.WriteAtOffset(SafeFileHandle handle, ReadOnlySpan`1 buffer, Int64 fileOffset)
at System.IO.StreamWriter.Flush(Boolean flushStream, Boolean flushEncoder)
at System.Diagnostics.TextWriterTraceListener.Flush()
at System.Diagnostics.TraceSource.Flush()
at GitHub.Runner.Common.Tracing.Dispose(Boolean disposing)
at GitHub.Runner.Common.Tracing.Dispose()
at GitHub.Runner.Common.TraceManager.Dispose(Boolean disposing)
at GitHub.Runner.Common.TraceManager.Dispose()
at GitHub.Runner.Common.HostContext.Dispose(Boolean disposing)
at GitHub.Runner.Common.HostContext.Dispose()
at GitHub.Runner.Worker.Program.Main(String[] args)
|
android-ubuntu-e2e-test-ci (x86, 28, default) / Android Ubuntu e2e test (transaction_history)
Process completed with exit code 1.
|
android-ubuntu-e2e-test-ci (x86_64, 30, default) / Android Ubuntu e2e test (transaction_history)
Process completed with exit code 1.
|
android-ubuntu-integration-test-ci (x86_64, 34, default) / Android Ubuntu Integration test (execute_sapling_balance_from_seed)
FailFast: cancelling since parallel instance has failed
|
|
android-ubuntu-e2e-test-ci (x86_64, 30, default) / Android Ubuntu e2e test (change_custom_server)
Process completed with exit code 1.
|
android-ubuntu-e2e-test-ci (x86_64, 30, default) / Android Ubuntu e2e test (send)
Process completed with exit code 1.
|
android-ubuntu-e2e-test-ci (x86_64, 30, default) / Android Ubuntu e2e test (parse_invalid_address)
Process completed with exit code 1.
|
android-ubuntu-e2e-test-ci (x86, 28, default) / Android Ubuntu e2e test (screen_awake)
Process completed with exit code 1.
|
android-ubuntu-e2e-test-ci (x86_64, 30, default) / Android Ubuntu e2e test (tex_send_address)
Cache not found for keys: v0-rust-android-ubuntu-e2e-test-ci-Linux-6be15664-da39a3ee, v0-rust-android-ubuntu-e2e-test-ci-Linux-6be15664
|
android-ubuntu-e2e-test-ci (x86_64, 30, default) / Android Ubuntu e2e test (tex_send_address)
Cache not found for keys: v0-rust-android-ubuntu-e2e-test-ci-Linux-6be15664-5abf5f57, v0-rust-android-ubuntu-e2e-test-ci-Linux-6be15664
|
android-ubuntu-e2e-test-ci (x86_64, 30, default) / Android Ubuntu e2e test (tex_send_address)
No files were found with the provided path: android/app/build/outputs/e2e_test_reports. No artifacts will be uploaded.
|
android-ubuntu-e2e-test-ci (x86_64, 30, default) / Android Ubuntu e2e test (tex_send_address)
Cache not found for keys: gradle-8.8
|
android-ubuntu-e2e-test-ci (x86, 28, default) / Android Ubuntu e2e test (change_custom_server)
Cache not found for keys: v0-rust-android-ubuntu-e2e-test-ci-Linux-6be15664-da39a3ee, v0-rust-android-ubuntu-e2e-test-ci-Linux-6be15664
|
android-ubuntu-e2e-test-ci (x86, 28, default) / Android Ubuntu e2e test (change_custom_server)
Cache not found for keys: gradle-8.8
|
android-ubuntu-e2e-test-ci (x86, 28, default) / Android Ubuntu e2e test (change_custom_server)
No files were found with the provided path: android/app/build/outputs/e2e_test_reports. No artifacts will be uploaded.
|
android-ubuntu-e2e-test-ci (x86, 28, default) / Android Ubuntu e2e test (change_custom_server)
Cache not found for keys: v0-rust-android-ubuntu-e2e-test-ci-Linux-6be15664-5abf5f57, v0-rust-android-ubuntu-e2e-test-ci-Linux-6be15664
|
android-ubuntu-e2e-test-ci (x86, 28, default) / Android Ubuntu e2e test (send)
Cache not found for keys: v0-rust-android-ubuntu-e2e-test-ci-Linux-6be15664-da39a3ee, v0-rust-android-ubuntu-e2e-test-ci-Linux-6be15664
|
android-ubuntu-e2e-test-ci (x86, 28, default) / Android Ubuntu e2e test (send)
Cache not found for keys: v0-rust-android-ubuntu-e2e-test-ci-Linux-6be15664-5abf5f57, v0-rust-android-ubuntu-e2e-test-ci-Linux-6be15664
|
android-ubuntu-e2e-test-ci (x86, 28, default) / Android Ubuntu e2e test (send)
Cache not found for keys: gradle-8.8
|
android-ubuntu-e2e-test-ci (x86, 28, default) / Android Ubuntu e2e test (send)
No files were found with the provided path: android/app/build/outputs/e2e_test_reports. No artifacts will be uploaded.
|
android-ubuntu-e2e-test-ci (x86_64, 30, default) / Android Ubuntu e2e test (sync_report)
Cache not found for keys: v0-rust-android-ubuntu-e2e-test-ci-Linux-6be15664-da39a3ee, v0-rust-android-ubuntu-e2e-test-ci-Linux-6be15664
|
android-ubuntu-e2e-test-ci (x86_64, 30, default) / Android Ubuntu e2e test (sync_report)
Cache not found for keys: v0-rust-android-ubuntu-e2e-test-ci-Linux-6be15664-5abf5f57, v0-rust-android-ubuntu-e2e-test-ci-Linux-6be15664
|
android-ubuntu-e2e-test-ci (x86_64, 30, default) / Android Ubuntu e2e test (sync_report)
Cache not found for keys: gradle-8.8
|
android-ubuntu-e2e-test-ci (x86_64, 30, default) / Android Ubuntu e2e test (sync_report)
No files were found with the provided path: android/app/build/outputs/e2e_test_reports. No artifacts will be uploaded.
|
android-ubuntu-e2e-test-ci (x86, 28, default) / Android Ubuntu e2e test (change_custom_regtest_server)
Cache not found for keys: v0-rust-android-ubuntu-e2e-test-ci-Linux-6be15664-da39a3ee, v0-rust-android-ubuntu-e2e-test-ci-Linux-6be15664
|
android-ubuntu-e2e-test-ci (x86, 28, default) / Android Ubuntu e2e test (change_custom_regtest_server)
Cache not found for keys: gradle-8.8
|
android-ubuntu-e2e-test-ci (x86, 28, default) / Android Ubuntu e2e test (change_custom_regtest_server)
No files were found with the provided path: android/app/build/outputs/e2e_test_reports. No artifacts will be uploaded.
|
android-ubuntu-e2e-test-ci (x86, 28, default) / Android Ubuntu e2e test (change_custom_regtest_server)
Cache not found for keys: v0-rust-android-ubuntu-e2e-test-ci-Linux-6be15664-5abf5f57, v0-rust-android-ubuntu-e2e-test-ci-Linux-6be15664
|
android-ubuntu-e2e-test-ci (x86_64, 30, default) / Android Ubuntu e2e test (change_custom_regtest_server)
Cache not found for keys: v0-rust-android-ubuntu-e2e-test-ci-Linux-6be15664-da39a3ee, v0-rust-android-ubuntu-e2e-test-ci-Linux-6be15664
|
android-ubuntu-e2e-test-ci (x86_64, 30, default) / Android Ubuntu e2e test (change_custom_regtest_server)
Cache not found for keys: gradle-8.8
|
android-ubuntu-e2e-test-ci (x86_64, 30, default) / Android Ubuntu e2e test (change_custom_regtest_server)
Cache not found for keys: v0-rust-android-ubuntu-e2e-test-ci-Linux-6be15664-5abf5f57, v0-rust-android-ubuntu-e2e-test-ci-Linux-6be15664
|
android-ubuntu-e2e-test-ci (x86_64, 30, default) / Android Ubuntu e2e test (change_custom_regtest_server)
No files were found with the provided path: android/app/build/outputs/e2e_test_reports. No artifacts will be uploaded.
|
android-ubuntu-integration-test-ci (x86, 29, default) / Android Ubuntu Integration test (offline_testsuite)
Cache not found for keys: gradle-8.8
|
android-ubuntu-e2e-test-ci (x86, 28, default) / Android Ubuntu e2e test (shielding)
Cache not found for keys: v0-rust-android-ubuntu-e2e-test-ci-Linux-6be15664-da39a3ee, v0-rust-android-ubuntu-e2e-test-ci-Linux-6be15664
|
android-ubuntu-e2e-test-ci (x86, 28, default) / Android Ubuntu e2e test (shielding)
No files were found with the provided path: android/app/build/outputs/e2e_test_reports. No artifacts will be uploaded.
|
android-ubuntu-e2e-test-ci (x86, 28, default) / Android Ubuntu e2e test (shielding)
Cache not found for keys: v0-rust-android-ubuntu-e2e-test-ci-Linux-6be15664-5abf5f57, v0-rust-android-ubuntu-e2e-test-ci-Linux-6be15664
|
android-ubuntu-e2e-test-ci (x86, 28, default) / Android Ubuntu e2e test (shielding)
Cache not found for keys: gradle-8.8
|
android-ubuntu-e2e-test-ci (x86_64, 30, default) / Android Ubuntu e2e test (reload_while_tx_pending)
Cache not found for keys: v0-rust-android-ubuntu-e2e-test-ci-Linux-6be15664-da39a3ee, v0-rust-android-ubuntu-e2e-test-ci-Linux-6be15664
|
android-ubuntu-e2e-test-ci (x86_64, 30, default) / Android Ubuntu e2e test (reload_while_tx_pending)
Cache not found for keys: gradle-8.8
|
android-ubuntu-e2e-test-ci (x86_64, 30, default) / Android Ubuntu e2e test (reload_while_tx_pending)
No files were found with the provided path: android/app/build/outputs/e2e_test_reports. No artifacts will be uploaded.
|
android-ubuntu-e2e-test-ci (x86_64, 30, default) / Android Ubuntu e2e test (reload_while_tx_pending)
Cache not found for keys: v0-rust-android-ubuntu-e2e-test-ci-Linux-6be15664-5abf5f57, v0-rust-android-ubuntu-e2e-test-ci-Linux-6be15664
|
android-ubuntu-integration-test-ci (x86, 29, default) / Android Ubuntu Integration test (execute_parse_addresses)
Cache not found for keys: gradle-8.8
|
android-ubuntu-e2e-test-ci (x86, 28, default) / Android Ubuntu e2e test (parse_invalid_address)
Cache not found for keys: v0-rust-android-ubuntu-e2e-test-ci-Linux-6be15664-da39a3ee, v0-rust-android-ubuntu-e2e-test-ci-Linux-6be15664
|
android-ubuntu-e2e-test-ci (x86, 28, default) / Android Ubuntu e2e test (parse_invalid_address)
No files were found with the provided path: android/app/build/outputs/e2e_test_reports. No artifacts will be uploaded.
|
android-ubuntu-e2e-test-ci (x86, 28, default) / Android Ubuntu e2e test (parse_invalid_address)
Cache not found for keys: v0-rust-android-ubuntu-e2e-test-ci-Linux-6be15664-5abf5f57, v0-rust-android-ubuntu-e2e-test-ci-Linux-6be15664
|
android-ubuntu-e2e-test-ci (x86, 28, default) / Android Ubuntu e2e test (parse_invalid_address)
Cache not found for keys: gradle-8.8
|
android-ubuntu-e2e-test-ci (x86, 28, default) / Android Ubuntu e2e test (change_server_from_list)
Cache not found for keys: v0-rust-android-ubuntu-e2e-test-ci-Linux-6be15664-da39a3ee, v0-rust-android-ubuntu-e2e-test-ci-Linux-6be15664
|
android-ubuntu-e2e-test-ci (x86, 28, default) / Android Ubuntu e2e test (change_server_from_list)
Cache not found for keys: gradle-8.8
|
android-ubuntu-e2e-test-ci (x86, 28, default) / Android Ubuntu e2e test (change_server_from_list)
No files were found with the provided path: android/app/build/outputs/e2e_test_reports. No artifacts will be uploaded.
|
android-ubuntu-e2e-test-ci (x86, 28, default) / Android Ubuntu e2e test (change_server_from_list)
Cache not found for keys: v0-rust-android-ubuntu-e2e-test-ci-Linux-6be15664-5abf5f57, v0-rust-android-ubuntu-e2e-test-ci-Linux-6be15664
|
android-ubuntu-e2e-test-ci (x86, 28, default) / Android Ubuntu e2e test (tex_send_address)
Cache not found for keys: v0-rust-android-ubuntu-e2e-test-ci-Linux-6be15664-da39a3ee, v0-rust-android-ubuntu-e2e-test-ci-Linux-6be15664
|
android-ubuntu-e2e-test-ci (x86, 28, default) / Android Ubuntu e2e test (tex_send_address)
Cache not found for keys: v0-rust-android-ubuntu-e2e-test-ci-Linux-6be15664-5abf5f57, v0-rust-android-ubuntu-e2e-test-ci-Linux-6be15664
|
android-ubuntu-e2e-test-ci (x86, 28, default) / Android Ubuntu e2e test (tex_send_address)
No files were found with the provided path: android/app/build/outputs/e2e_test_reports. No artifacts will be uploaded.
|
android-ubuntu-e2e-test-ci (x86, 28, default) / Android Ubuntu e2e test (tex_send_address)
Cache not found for keys: gradle-8.8
|
android-ubuntu-e2e-test-ci (x86_64, 30, default) / Android Ubuntu e2e test (shielding)
Cache not found for keys: v0-rust-android-ubuntu-e2e-test-ci-Linux-6be15664-da39a3ee, v0-rust-android-ubuntu-e2e-test-ci-Linux-6be15664
|
android-ubuntu-e2e-test-ci (x86_64, 30, default) / Android Ubuntu e2e test (shielding)
No files were found with the provided path: android/app/build/outputs/e2e_test_reports. No artifacts will be uploaded.
|
android-ubuntu-e2e-test-ci (x86_64, 30, default) / Android Ubuntu e2e test (shielding)
Cache not found for keys: v0-rust-android-ubuntu-e2e-test-ci-Linux-6be15664-5abf5f57, v0-rust-android-ubuntu-e2e-test-ci-Linux-6be15664
|
android-ubuntu-e2e-test-ci (x86_64, 30, default) / Android Ubuntu e2e test (shielding)
Cache not found for keys: gradle-8.8
|
android-ubuntu-e2e-test-ci (x86, 28, default) / Android Ubuntu e2e test (new_wallet)
Cache not found for keys: v0-rust-android-ubuntu-e2e-test-ci-Linux-6be15664-da39a3ee, v0-rust-android-ubuntu-e2e-test-ci-Linux-6be15664
|
android-ubuntu-e2e-test-ci (x86, 28, default) / Android Ubuntu e2e test (new_wallet)
Cache not found for keys: v0-rust-android-ubuntu-e2e-test-ci-Linux-6be15664-5abf5f57, v0-rust-android-ubuntu-e2e-test-ci-Linux-6be15664
|
android-ubuntu-e2e-test-ci (x86, 28, default) / Android Ubuntu e2e test (new_wallet)
No files were found with the provided path: android/app/build/outputs/e2e_test_reports. No artifacts will be uploaded.
|
android-ubuntu-e2e-test-ci (x86, 28, default) / Android Ubuntu e2e test (new_wallet)
Cache not found for keys: gradle-8.8
|
android-ubuntu-e2e-test-ci (x86, 28, default) / Android Ubuntu e2e test (sync_report)
Cache not found for keys: v0-rust-android-ubuntu-e2e-test-ci-Linux-6be15664-da39a3ee, v0-rust-android-ubuntu-e2e-test-ci-Linux-6be15664
|
android-ubuntu-e2e-test-ci (x86, 28, default) / Android Ubuntu e2e test (sync_report)
Cache not found for keys: v0-rust-android-ubuntu-e2e-test-ci-Linux-6be15664-5abf5f57, v0-rust-android-ubuntu-e2e-test-ci-Linux-6be15664
|
android-ubuntu-e2e-test-ci (x86, 28, default) / Android Ubuntu e2e test (sync_report)
No files were found with the provided path: android/app/build/outputs/e2e_test_reports. No artifacts will be uploaded.
|
android-ubuntu-e2e-test-ci (x86, 28, default) / Android Ubuntu e2e test (sync_report)
Cache not found for keys: gradle-8.8
|
android-ubuntu-e2e-test-ci (x86_64, 30, default) / Android Ubuntu e2e test (change_server_from_list)
Cache not found for keys: v0-rust-android-ubuntu-e2e-test-ci-Linux-6be15664-da39a3ee, v0-rust-android-ubuntu-e2e-test-ci-Linux-6be15664
|
android-ubuntu-e2e-test-ci (x86_64, 30, default) / Android Ubuntu e2e test (change_server_from_list)
No files were found with the provided path: android/app/build/outputs/e2e_test_reports. No artifacts will be uploaded.
|
android-ubuntu-e2e-test-ci (x86_64, 30, default) / Android Ubuntu e2e test (change_server_from_list)
Cache not found for keys: gradle-8.8
|
android-ubuntu-e2e-test-ci (x86_64, 30, default) / Android Ubuntu e2e test (change_server_from_list)
Cache not found for keys: v0-rust-android-ubuntu-e2e-test-ci-Linux-6be15664-5abf5f57, v0-rust-android-ubuntu-e2e-test-ci-Linux-6be15664
|
android-ubuntu-e2e-test-ci (x86, 28, default) / Android Ubuntu e2e test (reload_while_tx_pending)
Cache not found for keys: v0-rust-android-ubuntu-e2e-test-ci-Linux-6be15664-da39a3ee, v0-rust-android-ubuntu-e2e-test-ci-Linux-6be15664
|
android-ubuntu-e2e-test-ci (x86, 28, default) / Android Ubuntu e2e test (reload_while_tx_pending)
No files were found with the provided path: android/app/build/outputs/e2e_test_reports. No artifacts will be uploaded.
|
android-ubuntu-e2e-test-ci (x86, 28, default) / Android Ubuntu e2e test (reload_while_tx_pending)
Cache not found for keys: v0-rust-android-ubuntu-e2e-test-ci-Linux-6be15664-5abf5f57, v0-rust-android-ubuntu-e2e-test-ci-Linux-6be15664
|
android-ubuntu-e2e-test-ci (x86, 28, default) / Android Ubuntu e2e test (reload_while_tx_pending)
Cache not found for keys: gradle-8.8
|
android-ubuntu-integration-test-ci (x86_64, 34, default) / Android Ubuntu Integration test (execute_sync_from_seed)
Cache not found for keys: gradle-8.8
|
android-ubuntu-integration-test-ci (x86_64, 34, default) / Android Ubuntu Integration test (execute_sync_from_seed)
No files were found with the provided path: android/app/build/outputs/integration_test_reports. No artifacts will be uploaded.
|
android-ubuntu-integration-test-ci (x86_64, 34, default) / Android Ubuntu Integration test (offline_testsuite)
No files were found with the provided path: android/app/build/outputs/integration_test_reports. No artifacts will be uploaded.
|
android-ubuntu-integration-test-ci (x86_64, 34, default) / Android Ubuntu Integration test (offline_testsuite)
Cache not found for keys: gradle-8.8
|
android-ubuntu-integration-test-ci (x86_64, 34, default) / Android Ubuntu Integration test (execute_send_from_orchard)
Cache not found for keys: gradle-8.8
|
android-ubuntu-integration-test-ci (x86_64, 34, default) / Android Ubuntu Integration test (execute_send_from_orchard)
No files were found with the provided path: android/app/build/outputs/integration_test_reports. No artifacts will be uploaded.
|
android-ubuntu-integration-test-ci (x86_64, 34, default) / Android Ubuntu Integration test (execute_currentprice_and_value_transfers_from_seed)
Cache not found for keys: gradle-8.8
|
android-ubuntu-integration-test-ci (x86_64, 34, default) / Android Ubuntu Integration test (execute_currentprice_and_value_transfers_from_seed)
No files were found with the provided path: android/app/build/outputs/integration_test_reports. No artifacts will be uploaded.
|
android-ubuntu-integration-test-ci (x86, 29, default) / Android Ubuntu Integration test (execute_sapling_balance_from_seed)
Cache not found for keys: gradle-8.8
|
android-ubuntu-e2e-test-ci (x86_64, 30, default) / Android Ubuntu e2e test (screen_awake)
Cache not found for keys: v0-rust-android-ubuntu-e2e-test-ci-Linux-6be15664-da39a3ee, v0-rust-android-ubuntu-e2e-test-ci-Linux-6be15664
|
android-ubuntu-e2e-test-ci (x86_64, 30, default) / Android Ubuntu e2e test (screen_awake)
No files were found with the provided path: android/app/build/outputs/e2e_test_reports. No artifacts will be uploaded.
|
android-ubuntu-e2e-test-ci (x86_64, 30, default) / Android Ubuntu e2e test (screen_awake)
Cache not found for keys: v0-rust-android-ubuntu-e2e-test-ci-Linux-6be15664-5abf5f57, v0-rust-android-ubuntu-e2e-test-ci-Linux-6be15664
|
android-ubuntu-e2e-test-ci (x86_64, 30, default) / Android Ubuntu e2e test (screen_awake)
Cache not found for keys: gradle-8.8
|
android-ubuntu-integration-test-ci (x86, 29, default) / Android Ubuntu Integration test (execute_currentprice_and_value_transfers_from_seed)
You are running out of disk space. The runner will stop working when the machine runs out of disk space. Free space left: 69 MB
|
android-ubuntu-integration-test-ci (x86, 29, default) / Android Ubuntu Integration test (execute_currentprice_and_value_transfers_from_seed)
Cache not found for keys: gradle-8.8
|
android-ubuntu-e2e-test-ci (x86_64, 30, default) / Android Ubuntu e2e test (new_wallet)
Cache not found for keys: v0-rust-android-ubuntu-e2e-test-ci-Linux-6be15664-da39a3ee, v0-rust-android-ubuntu-e2e-test-ci-Linux-6be15664
|
android-ubuntu-e2e-test-ci (x86_64, 30, default) / Android Ubuntu e2e test (new_wallet)
Cache not found for keys: v0-rust-android-ubuntu-e2e-test-ci-Linux-6be15664-5abf5f57, v0-rust-android-ubuntu-e2e-test-ci-Linux-6be15664
|
android-ubuntu-e2e-test-ci (x86_64, 30, default) / Android Ubuntu e2e test (new_wallet)
No files were found with the provided path: android/app/build/outputs/e2e_test_reports. No artifacts will be uploaded.
|
android-ubuntu-e2e-test-ci (x86_64, 30, default) / Android Ubuntu e2e test (new_wallet)
Cache not found for keys: gradle-8.8
|
android-ubuntu-e2e-test-ci (x86_64, 30, default) / Android Ubuntu e2e test (change_custom_testnet_server)
Cache not found for keys: v0-rust-android-ubuntu-e2e-test-ci-Linux-6be15664-da39a3ee, v0-rust-android-ubuntu-e2e-test-ci-Linux-6be15664
|
android-ubuntu-e2e-test-ci (x86_64, 30, default) / Android Ubuntu e2e test (change_custom_testnet_server)
No files were found with the provided path: android/app/build/outputs/e2e_test_reports. No artifacts will be uploaded.
|
android-ubuntu-e2e-test-ci (x86_64, 30, default) / Android Ubuntu e2e test (change_custom_testnet_server)
Cache not found for keys: gradle-8.8
|
android-ubuntu-e2e-test-ci (x86_64, 30, default) / Android Ubuntu e2e test (change_custom_testnet_server)
Cache not found for keys: v0-rust-android-ubuntu-e2e-test-ci-Linux-6be15664-5abf5f57, v0-rust-android-ubuntu-e2e-test-ci-Linux-6be15664
|
android-ubuntu-integration-test-ci (x86, 29, default) / Android Ubuntu Integration test (execute_sync_from_seed)
Cache not found for keys: gradle-8.8
|
android-ubuntu-integration-test-ci (x86_64, 34, default) / Android Ubuntu Integration test (execute_parse_addresses)
No files were found with the provided path: android/app/build/outputs/integration_test_reports. No artifacts will be uploaded.
|
android-ubuntu-integration-test-ci (x86_64, 34, default) / Android Ubuntu Integration test (execute_parse_addresses)
Cache not found for keys: gradle-8.8
|
android-ubuntu-e2e-test-ci (x86, 28, default) / Android Ubuntu e2e test (change_custom_testnet_server)
Cache not found for keys: v0-rust-android-ubuntu-e2e-test-ci-Linux-6be15664-da39a3ee, v0-rust-android-ubuntu-e2e-test-ci-Linux-6be15664
|
android-ubuntu-e2e-test-ci (x86, 28, default) / Android Ubuntu e2e test (change_custom_testnet_server)
No files were found with the provided path: android/app/build/outputs/e2e_test_reports. No artifacts will be uploaded.
|
android-ubuntu-e2e-test-ci (x86, 28, default) / Android Ubuntu e2e test (change_custom_testnet_server)
Cache not found for keys: gradle-8.8
|
android-ubuntu-e2e-test-ci (x86, 28, default) / Android Ubuntu e2e test (change_custom_testnet_server)
Cache not found for keys: v0-rust-android-ubuntu-e2e-test-ci-Linux-6be15664-5abf5f57, v0-rust-android-ubuntu-e2e-test-ci-Linux-6be15664
|
android-ubuntu-integration-test-ci (x86, 29, default) / Android Ubuntu Integration test (execute_send_from_orchard)
Cache not found for keys: gradle-8.8
|
android-ubuntu-e2e-test-ci (x86, 28, default) / Android Ubuntu e2e test (transaction_history)
Cache not found for keys: v0-rust-android-ubuntu-e2e-test-ci-Linux-6be15664-da39a3ee, v0-rust-android-ubuntu-e2e-test-ci-Linux-6be15664
|
android-ubuntu-e2e-test-ci (x86, 28, default) / Android Ubuntu e2e test (transaction_history)
Cache not found for keys: v0-rust-android-ubuntu-e2e-test-ci-Linux-6be15664-5abf5f57, v0-rust-android-ubuntu-e2e-test-ci-Linux-6be15664
|
android-ubuntu-e2e-test-ci (x86, 28, default) / Android Ubuntu e2e test (transaction_history)
Cache not found for keys: gradle-8.8
|
android-ubuntu-e2e-test-ci (x86, 28, default) / Android Ubuntu e2e test (transaction_history)
No files were found with the provided path: android/app/build/outputs/e2e_test_reports. No artifacts will be uploaded.
|
android-ubuntu-e2e-test-ci (x86_64, 30, default) / Android Ubuntu e2e test (transaction_history)
Cache not found for keys: v0-rust-android-ubuntu-e2e-test-ci-Linux-6be15664-da39a3ee, v0-rust-android-ubuntu-e2e-test-ci-Linux-6be15664
|
android-ubuntu-e2e-test-ci (x86_64, 30, default) / Android Ubuntu e2e test (transaction_history)
Cache not found for keys: v0-rust-android-ubuntu-e2e-test-ci-Linux-6be15664-5abf5f57, v0-rust-android-ubuntu-e2e-test-ci-Linux-6be15664
|
android-ubuntu-e2e-test-ci (x86_64, 30, default) / Android Ubuntu e2e test (transaction_history)
Cache not found for keys: gradle-8.8
|
android-ubuntu-e2e-test-ci (x86_64, 30, default) / Android Ubuntu e2e test (transaction_history)
No files were found with the provided path: android/app/build/outputs/e2e_test_reports. No artifacts will be uploaded.
|
android-ubuntu-integration-test-ci (x86_64, 34, default) / Android Ubuntu Integration test (execute_sapling_balance_from_seed)
Cache not found for keys: gradle-8.8
|
android-ubuntu-e2e-test-ci (x86_64, 30, default) / Android Ubuntu e2e test (change_custom_server)
Cache not found for keys: v0-rust-android-ubuntu-e2e-test-ci-Linux-6be15664-da39a3ee, v0-rust-android-ubuntu-e2e-test-ci-Linux-6be15664
|
android-ubuntu-e2e-test-ci (x86_64, 30, default) / Android Ubuntu e2e test (change_custom_server)
Cache not found for keys: v0-rust-android-ubuntu-e2e-test-ci-Linux-6be15664-5abf5f57, v0-rust-android-ubuntu-e2e-test-ci-Linux-6be15664
|
android-ubuntu-e2e-test-ci (x86_64, 30, default) / Android Ubuntu e2e test (change_custom_server)
No files were found with the provided path: android/app/build/outputs/e2e_test_reports. No artifacts will be uploaded.
|
android-ubuntu-e2e-test-ci (x86_64, 30, default) / Android Ubuntu e2e test (change_custom_server)
Cache not found for keys: gradle-8.8
|
android-ubuntu-e2e-test-ci (x86_64, 30, default) / Android Ubuntu e2e test (send)
Cache not found for keys: v0-rust-android-ubuntu-e2e-test-ci-Linux-6be15664-da39a3ee, v0-rust-android-ubuntu-e2e-test-ci-Linux-6be15664
|
android-ubuntu-e2e-test-ci (x86_64, 30, default) / Android Ubuntu e2e test (send)
Cache not found for keys: v0-rust-android-ubuntu-e2e-test-ci-Linux-6be15664-5abf5f57, v0-rust-android-ubuntu-e2e-test-ci-Linux-6be15664
|
android-ubuntu-e2e-test-ci (x86_64, 30, default) / Android Ubuntu e2e test (send)
No files were found with the provided path: android/app/build/outputs/e2e_test_reports. No artifacts will be uploaded.
|
android-ubuntu-e2e-test-ci (x86_64, 30, default) / Android Ubuntu e2e test (send)
Cache not found for keys: gradle-8.8
|
android-ubuntu-e2e-test-ci (x86_64, 30, default) / Android Ubuntu e2e test (parse_invalid_address)
Cache not found for keys: v0-rust-android-ubuntu-e2e-test-ci-Linux-6be15664-da39a3ee, v0-rust-android-ubuntu-e2e-test-ci-Linux-6be15664
|
android-ubuntu-e2e-test-ci (x86_64, 30, default) / Android Ubuntu e2e test (parse_invalid_address)
Cache not found for keys: v0-rust-android-ubuntu-e2e-test-ci-Linux-6be15664-5abf5f57, v0-rust-android-ubuntu-e2e-test-ci-Linux-6be15664
|
android-ubuntu-e2e-test-ci (x86_64, 30, default) / Android Ubuntu e2e test (parse_invalid_address)
Cache not found for keys: gradle-8.8
|
android-ubuntu-e2e-test-ci (x86_64, 30, default) / Android Ubuntu e2e test (parse_invalid_address)
No files were found with the provided path: android/app/build/outputs/e2e_test_reports. No artifacts will be uploaded.
|
android-ubuntu-e2e-test-ci (x86, 28, default) / Android Ubuntu e2e test (screen_awake)
Cache not found for keys: v0-rust-android-ubuntu-e2e-test-ci-Linux-6be15664-da39a3ee, v0-rust-android-ubuntu-e2e-test-ci-Linux-6be15664
|
android-ubuntu-e2e-test-ci (x86, 28, default) / Android Ubuntu e2e test (screen_awake)
Cache not found for keys: gradle-8.8
|
android-ubuntu-e2e-test-ci (x86, 28, default) / Android Ubuntu e2e test (screen_awake)
Cache not found for keys: v0-rust-android-ubuntu-e2e-test-ci-Linux-6be15664-5abf5f57, v0-rust-android-ubuntu-e2e-test-ci-Linux-6be15664
|
android-ubuntu-e2e-test-ci (x86, 28, default) / Android Ubuntu e2e test (screen_awake)
No files were found with the provided path: android/app/build/outputs/e2e_test_reports. No artifacts will be uploaded.
|
ios-integration-test / IOS Integration test
Attempt 1 failed. Reason: Child_process exited with error code 65
|